GUI acceptance tests using environment deployed from packages.

Build: #2764 failed

Job: Oneprovider archives recall failed

Stages & jobs

  1. Qnthack - copy quarantine

  2. Acceptance Test

  3. Qnthack - rerun

user fails to recall archive if there is no space enough on device[1oz 2op slow file operations]: Test case result

The below summarizes the result of the test " user fails to recall archive if there is no space enough on device[1oz 2op slow file operations]" in build 2,764 of Onedata Products - gui acceptance pkg - Oneprovider archives recall.
Description
user fails to recall archive if there is no space enough on device[1oz 2op slow file operations]
Test class
gui.scenarios.test_oneprovider_archives_recall
Method
test_user_fails_to_recall_archive_if_there_is_no_space_enough_on_device[1oz_2op_slow_file_operations]
Jira Issue
Duration
8 mins
Status
Failed (New Failure)

Error Log

selenium.common.exceptions.StaleElementReferenceException: Message: stale element reference: element is not attached to the page document   (Session info: chrome=104.0.5112.79)
request = <FixtureRequest for <Function 'test_user_fails_to_recall_archive_if_there_is_no_space_enough_on_device[1oz_2op_slow_file_operations]'>>

    @pytest.mark.usefixtures(*function_args)
    def scenario_wrapper(request):
>       _execute_scenario(feature, scenario, request, encoding)

/usr/local/lib/python3.8/dist-packages/pytest_bdd/scenario.py:227: 
_ _ _ _ _ _ _ _ _ _ _ _ _ _ _ _ _ _ _ _ _ _ _ _ _ _ _ _ _ _ _ _ _ _ _ _ _ _ _ _ 
/usr/local/lib/python3.8/dist-packages/pytest_bdd/scenario.py:189: in _execute_scenario
    _execute_step_function(request, scenario, step, step_func)
/usr/local/lib/python3.8/dist-packages/pytest_bdd/scenario.py:130: in _execute_step_function
    step_func(**kwargs)
tests/utils/bdd_utils.py:78: in wrapper
    return fun(*ba.args, **ba.kwargs)
tests/gui/steps/oneprovider/archives_recall.py:170: in assert_number_of_entries_in_archive_recall
    detected_entries = _scroll_and_check_condition(browser_id, selenium, modals,
tests/gui/steps/oneprovider/archives_recall.py:247: in _scroll_and_check_condition
    new_entries = [entry.text.split('\n')[1] for entry in entries if
tests/gui/steps/oneprovider/archives_recall.py:248: in <listcomp>
    len(entry.text.split('\n')) > 1]
/usr/local/lib/python3.8/dist-packages/selenium/webdriver/remote/webelement.py:76: in text
    return self._execute(Command.GET_ELEMENT_TEXT)['value']
/usr/local/lib/python3.8/dist-packages/selenium/webdriver/remote/webelement.py:628: in _execute
    return self._parent.execute(command, params)
/usr/local/lib/python3.8/dist-packages/selenium/webdriver/remote/webdriver.py:320: in execute
    self.error_handler.check_response(response)
_ _ _ _ _ _ _ _ _ _ _ _ _ _ _ _ _ _ _ _ _ _ _ _ _ _ _ _ _ _ _ _ _ _ _ _ _ _ _ _ 

self = <selenium.webdriver.remote.errorhandler.ErrorHandler object at 0x7f86c46ebd30>
response = {'status': 404, 'value': '{"value":{"error":"stale element reference","message":"stale element reference: element is n...\\n#19 0x55c321cb73bf \\u003Cunknown>\\n#20 0x55c321cd1abe \\u003Cunknown>\\n#21 0x7f3b2a7ea609 \\u003Cunknown>\\n"}}'}

    def check_response(self, response):
        """
            Checks that a JSON response from the WebDriver does not have an error.
    
            :Args:
             - response - The JSON response from the WebDriver server as a dictionary
               object.
    
            :Raises: If the response contains an error message.
            """
        status = response.get('status', None)
        if status is None or status == ErrorCode.SUCCESS:
            return
        value = None
        message = response.get("message", "")
        screen = response.get("screen", "")
        stacktrace = None
        if isinstance(status, int):
            value_json = response.get('value', None)
            if value_json and isinstance(value_json, basestring):
                import json
                try:
                    value = json.loads(value_json)
                    if len(value.keys()) == 1:
                        value = value['value']
                    status = value.get('error', None)
                    if status is None:
                        status = value["status"]
                        message = value["value"]
                        if not isinstance(message, basestring):
                            value = message
                            message = message.get('message')
                    else:
                        message = value.get('message', None)
                except ValueError:
                    pass
    
        exception_class = ErrorInResponseException
        if status in ErrorCode.NO_SUCH_ELEMENT:
            exception_class = NoSuchElementException
        elif status in ErrorCode.NO_SUCH_FRAME:
            exception_class = NoSuchFrameException
        elif status in ErrorCode.NO_SUCH_WINDOW:
            exception_class = NoSuchWindowException
        elif status in ErrorCode.STALE_ELEMENT_REFERENCE:
            exception_class = StaleElementReferenceException
        elif status in ErrorCode.ELEMENT_NOT_VISIBLE:
            exception_class = ElementNotVisibleException
        elif status in ErrorCode.INVALID_ELEMENT_STATE:
            exception_class = InvalidElementStateException
        elif status in ErrorCode.INVALID_SELECTOR \
                or status in ErrorCode.INVALID_XPATH_SELECTOR \
                or status in ErrorCode.INVALID_XPATH_SELECTOR_RETURN_TYPER:
            exception_class = InvalidSelectorException
        elif status in ErrorCode.ELEMENT_IS_NOT_SELECTABLE:
            exception_class = ElementNotSelectableException
        elif status in ErrorCode.ELEMENT_NOT_INTERACTABLE:
            exception_class = ElementNotInteractableException
        elif status in ErrorCode.INVALID_COOKIE_DOMAIN:
            exception_class = InvalidCookieDomainException
        elif status in ErrorCode.UNABLE_TO_SET_COOKIE:
            exception_class = UnableToSetCookieException
        elif status in ErrorCode.TIMEOUT:
            exception_class = TimeoutException
        elif status in ErrorCode.SCRIPT_TIMEOUT:
            exception_class = TimeoutException
        elif status in ErrorCode.UNKNOWN_ERROR:
            exception_class = WebDriverException
        elif status in ErrorCode.UNEXPECTED_ALERT_OPEN:
            exception_class = UnexpectedAlertPresentException
        elif status in ErrorCode.NO_ALERT_OPEN:
            exception_class = NoAlertPresentException
        elif status in ErrorCode.IME_NOT_AVAILABLE:
            exception_class = ImeNotAvailableException
        elif status in ErrorCode.IME_ENGINE_ACTIVATION_FAILED:
            exception_class = ImeActivationFailedException
        elif status in ErrorCode.MOVE_TARGET_OUT_OF_BOUNDS:
            exception_class = MoveTargetOutOfBoundsException
        elif status in ErrorCode.JAVASCRIPT_ERROR:
            exception_class = JavascriptException
        elif status in ErrorCode.SESSION_NOT_CREATED:
            exception_class = SessionNotCreatedException
        elif status in ErrorCode.INVALID_ARGUMENT:
            exception_class = InvalidArgumentException
        elif status in ErrorCode.NO_SUCH_COOKIE:
            exception_class = NoSuchCookieException
        elif status in ErrorCode.UNABLE_TO_CAPTURE_SCREEN:
            exception_class = ScreenshotException
        elif status in ErrorCode.ELEMENT_CLICK_INTERCEPTED:
            exception_class = ElementClickInterceptedException
        elif status in ErrorCode.INSECURE_CERTIFICATE:
            exception_class = InsecureCertificateException
        elif status in ErrorCode.INVALID_COORDINATES:
            exception_class = InvalidCoordinatesException
        elif status in ErrorCode.INVALID_SESSION_ID:
            exception_class = InvalidSessionIdException
        elif status in ErrorCode.UNKNOWN_METHOD:
            exception_class = UnknownMethodException
        else:
            exception_class = WebDriverException
        if value == '' or value is None:
            value = response['value']
        if isinstance(value, basestring):
            if exception_class == ErrorInResponseException:
                raise exception_class(response, value)
            raise exception_class(value)
        if message == "" and 'message' in value:
            message = value['message']
    
        screen = None
        if 'screen' in value:
            screen = value['screen']
    
        stacktrace = None
        if 'stackTrace' in value and value['stackTrace']:
            stacktrace = []
            try:
                for frame in value['stackTrace']:
                    line = self._value_or_default(frame, 'lineNumber', '')
                    file = self._value_or_default(frame, 'fileName', '<anonymous>')
                    if line:
                        file = "%s:%s" % (file, line)
                    meth = self._value_or_default(frame, 'methodName', '<anonymous>')
                    if 'className' in frame:
                        meth = "%s.%s" % (frame['className'], meth)
                    msg = "    at %s (%s)"
                    msg = msg % (meth, file)
                    stacktrace.append(msg)
            except TypeError:
                pass
        if exception_class == ErrorInResponseException:
            raise exception_class(response, message)
        elif exception_class == UnexpectedAlertPresentException:
            alert_text = None
            if 'data' in value:
                alert_text = value['data'].get('text')
            elif 'alert' in value:
                alert_text = value['alert'].get('text')
            raise exception_class(message, screen, stacktrace, alert_text)
>       raise exception_class(message, screen, stacktrace)
E       selenium.common.exceptions.StaleElementReferenceException: Message: stale element reference: element is not attached to the page document
E         (Session info: chrome=104.0.5112.79)

/usr/local/lib/python3.8/dist-packages/selenium/webdriver/remote/errorhandler.py:242: StaleElementReferenceException