Acceptance tests using different clients concurrently. Environment deployed from packages.
Build: #3038 failed Child of ODSRV-OZP-1965
Build result summary
Details
- Completed
- Queue duration
- 2 seconds
- Duration
- 61 minutes
- Labels
- None
- Revision
-
078552e78cd63d72adc5640692d19133080f2eab
- Total tests
- 486
- Fixed in
- #3039 (Child of ODSRV-OPRPM-2450)
Tests
- 0 New failures
- 0 Existing failures
- 0 Fixed
Responsible
No one has taken responsibility for this failure
Error summary for Archives
The job generated some errors, drill down into the full build log for more details.
% Total % Received % Xferd Average Speed Time Time Time Current
Dload Upload Total Spent Left Speed
0 0 0 0 0 0 0 0 --:--:-- --:--:-- --:--:-- 0
100 4822 100 4822 0 0 48707 0 --:--:-- --:--:-- --:--:-- 48707
Error response from daemon: Cannot kill container: 6f4678efe053: Container 6f4678efe05320acb0239855a254735c08ba40c62302e67435628cd7d1c36fa6 is not running
Submodule 'automation-examples' (ssh://git@git.onedata.org:7999/vfs/automation-examples.git) registered for path 'automation-examples'
Submodule 'bamboos' (ssh://git@git.onedata.org:7999/vfs/bamboos.git) registered for path 'bamboos'
Submodule 'cdmi_swagger' (ssh://git@git.onedata.org:7999/vfs/cdmi-swagger.git) registered for path 'cdmi_swagger'
Submodule 'one_env' (ssh://git@git.onedata.org:7999/vfs/one-env.git) registered for path 'one_env'
Submodule 'onepanel_swagger' (ssh://git@git.onedata.org:7999/vfs/onepanel-swagger.git) registered for path 'onepanel_swagger'
Submodule 'oneprovider_swagger' (ssh://git@git.onedata.org:7999/vfs/oneprovider-swagger.git) registered for path 'oneprovider_swagger'
Submodule 'onezone_swagger' (ssh://git@git.onedata.org:7999/vfs/onezone-swagger.git) registered for path 'onezone_swagger'
Cloning into '/mnt/storage/bamboo-agent-home/xml-data/build-dir/ODSRV-MAOPT-CAT3/onedata-acceptance/automation-examples'...
Cloning into '/mnt/storage/bamboo-agent-home/xml-data/build-dir/ODSRV-MAOPT-CAT3/onedata-acceptance/bamboos'...
Cloning into '/mnt/storage/bamboo-agent-home/xml-data/build-dir/ODSRV-MAOPT-CAT3/onedata-acceptance/cdmi_swagger'...
Cloning into '/mnt/storage/bamboo-agent-home/xml-data/build-dir/ODSRV-MAOPT-CAT3/onedata-acceptance/one_env'...
Cloning into '/mnt/storage/bamboo-agent-home/xml-data/build-dir/ODSRV-MAOPT-CAT3/onedata-acceptance/onepanel_swagger'...
Cloning into '/mnt/storage/bamboo-agent-home/xml-data/build-dir/ODSRV-MAOPT-CAT3/onedata-acceptance/oneprovider_swagger'...
Cloning into '/mnt/storage/bamboo-agent-home/xml-data/build-dir/ODSRV-MAOPT-CAT3/onedata-acceptance/onezone_swagger'...
Submodule 'bamboos' (ssh://git@git.onedata.org:7999/vfs/bamboos.git) registered for path 'onepanel_swagger/bamboos'
Cloning into '/mnt/storage/bamboo-agent-home/xml-data/build-dir/ODSRV-MAOPT-CAT3/onedata-acceptance/onepanel_swagger/bamboos'...
Submodule 'bamboos' (ssh://git@git.onedata.org:7999/vfs/bamboos.git) registered for path 'oneprovider_swagger/bamboos'
Cloning into '/mnt/storage/bamboo-agent-home/xml-data/build-dir/ODSRV-MAOPT-CAT3/onedata-acceptance/oneprovider_swagger/bamboos'...
Submodule 'bamboos' (ssh://git@git.onedata.org:7999/vfs/bamboos.git) registered for path 'onezone_swagger/bamboos'
Cloning into '/mnt/storage/bamboo-agent-home/xml-data/build-dir/ODSRV-MAOPT-CAT3/onedata-acceptance/onezone_swagger/bamboos'...
error: failed to create clusterrolebinding: clusterrolebindings.rbac.authorization.k8s.io "serviceaccounts-cluster-admin" already exists
Unable to find image 'docker.onedata.org/swagger-aggregator:1.5.0' locally
1.5.0: Pulling from swagger-aggregator
3e51df1a11ab: Pulling fs layer
afe1a672db39: Pulling fs layer
80bad90eec10: Pulling fs layer
ca328de5836f: Pulling fs layer
4f4fb700ef54: Pulling fs layer
f9032f2640a0: Pulling fs layer
982a4aef97ed: Pulling fs layer
aca789ddad1c: Pulling fs layer
a3e17b3016f6: Pulling fs layer
b67d253c6e22: Pulling fs layer
302c9eabb2bb: Pulling fs layer
bb6e4824f633: Pulling fs layer
4f4fb700ef54: Waiting
f9032f2640a0: Waiting
b67d253c6e22: Waiting
302c9eabb2bb: Waiting
982a4aef97ed: Waiting
bb6e4824f633: Waiting
aca789ddad1c: Waiting
a3e17b3016f6: Waiting
ca328de5836f: Waiting
80bad90eec10: Verifying Checksum
80bad90eec10: Download complete
afe1a672db39: Verifying Checksum
afe1a672db39: Download complete
ca328de5836f: Verifying Checksum
ca328de5836f: Download complete
4f4fb700ef54: Verifying Checksum
4f4fb700ef54: Download complete
3e51df1a11ab: Download complete
aca789ddad1c: Verifying Checksum
aca789ddad1c: Download complete
a3e17b3016f6: Verifying Checksum
a3e17b3016f6: Download complete
b67d253c6e22: Verifying Checksum
b67d253c6e22: Download complete
302c9eabb2bb: Verifying Checksum
302c9eabb2bb: Download complete
bb6e4824f633: Verifying Checksum
bb6e4824f633: Download complete
982a4aef97ed: Verifying Checksum
982a4aef97ed: Download complete
3e51df1a11ab: Pull complete
afe1a672db39: Pull complete
80bad90eec10: Pull complete
ca328de5836f: Pull complete
4f4fb700ef54: Pull complete
f9032f2640a0: Verifying Checksum
f9032f2640a0: Download complete
f9032f2640a0: Pull complete
982a4aef97ed: Pull complete
aca789ddad1c: Pull complete
a3e17b3016f6: Pull complete
b67d253c6e22: Pull complete
302c9eabb2bb: Pull complete
bb6e4824f633: Pull complete
Digest: sha256:e2e8e762a03a0acdd49e63c4168157cb4e0e79f31f4e815561e9f4c65dbf8ac8
Status: Downloaded newer image for docker.onedata.org/swagger-aggregator:1.5.0
docker: Error response from daemon: No such image: docker.onedata.org/swagger-aggregator:1.5.0.
See 'docker run --help'.
make[1]: *** [Makefile:22: swagger.json] Error 125
make: *** [Makefile:134: build_swaggers] Error 2
tar: test-reports/results*.xml: Cannot stat: No such file or directory
tar: Exiting with failure status due to previous errors
cp: cannot stat 'onedata-acceptance/test-reports/*.xml': No such file or directory
cp: cannot stat 'onedata-acceptance/one_env/sources_info.yaml': No such file or directory
mv: cannot stat 'onedata-acceptance/tests/mixed/logs/report.*': No such file or directory
mv: cannot stat 'onedata-acceptance/tests/mixed/logs/gui_report/images.yaml': No such file or directory
% Total % Received % Xferd Average Speed Time Time Time Current
Dload Upload Total Spent Left Speed
0 0 0 0 0 0 0 0 --:--:-- --:--:-- --:--:-- 0
0 0 0 0 0 0 0 0 --:--:-- --:--:-- --:--:-- 0
100 4822 100 4822 0 0 46815 0 --:--:-- --:--:-- --:--:-- 46365
Error response from daemon: Cannot kill container: 32753428d301: Container 32753428d301596ce3d6ac6dda5032ffeeb4dcf39c66e422f27c82142adbeb43 is not running
Dload Upload Total Spent Left Speed
0 0 0 0 0 0 0 0 --:--:-- --:--:-- --:--:-- 0
100 4822 100 4822 0 0 48707 0 --:--:-- --:--:-- --:--:-- 48707
Error response from daemon: Cannot kill container: 6f4678efe053: Container 6f4678efe05320acb0239855a254735c08ba40c62302e67435628cd7d1c36fa6 is not running
Submodule 'automation-examples' (ssh://git@git.onedata.org:7999/vfs/automation-examples.git) registered for path 'automation-examples'
Submodule 'bamboos' (ssh://git@git.onedata.org:7999/vfs/bamboos.git) registered for path 'bamboos'
Submodule 'cdmi_swagger' (ssh://git@git.onedata.org:7999/vfs/cdmi-swagger.git) registered for path 'cdmi_swagger'
Submodule 'one_env' (ssh://git@git.onedata.org:7999/vfs/one-env.git) registered for path 'one_env'
Submodule 'onepanel_swagger' (ssh://git@git.onedata.org:7999/vfs/onepanel-swagger.git) registered for path 'onepanel_swagger'
Submodule 'oneprovider_swagger' (ssh://git@git.onedata.org:7999/vfs/oneprovider-swagger.git) registered for path 'oneprovider_swagger'
Submodule 'onezone_swagger' (ssh://git@git.onedata.org:7999/vfs/onezone-swagger.git) registered for path 'onezone_swagger'
Cloning into '/mnt/storage/bamboo-agent-home/xml-data/build-dir/ODSRV-MAOPT-CAT3/onedata-acceptance/automation-examples'...
Cloning into '/mnt/storage/bamboo-agent-home/xml-data/build-dir/ODSRV-MAOPT-CAT3/onedata-acceptance/bamboos'...
Cloning into '/mnt/storage/bamboo-agent-home/xml-data/build-dir/ODSRV-MAOPT-CAT3/onedata-acceptance/cdmi_swagger'...
Cloning into '/mnt/storage/bamboo-agent-home/xml-data/build-dir/ODSRV-MAOPT-CAT3/onedata-acceptance/one_env'...
Cloning into '/mnt/storage/bamboo-agent-home/xml-data/build-dir/ODSRV-MAOPT-CAT3/onedata-acceptance/onepanel_swagger'...
Cloning into '/mnt/storage/bamboo-agent-home/xml-data/build-dir/ODSRV-MAOPT-CAT3/onedata-acceptance/oneprovider_swagger'...
Cloning into '/mnt/storage/bamboo-agent-home/xml-data/build-dir/ODSRV-MAOPT-CAT3/onedata-acceptance/onezone_swagger'...
Submodule 'bamboos' (ssh://git@git.onedata.org:7999/vfs/bamboos.git) registered for path 'onepanel_swagger/bamboos'
Cloning into '/mnt/storage/bamboo-agent-home/xml-data/build-dir/ODSRV-MAOPT-CAT3/onedata-acceptance/onepanel_swagger/bamboos'...
Submodule 'bamboos' (ssh://git@git.onedata.org:7999/vfs/bamboos.git) registered for path 'oneprovider_swagger/bamboos'
Cloning into '/mnt/storage/bamboo-agent-home/xml-data/build-dir/ODSRV-MAOPT-CAT3/onedata-acceptance/oneprovider_swagger/bamboos'...
Submodule 'bamboos' (ssh://git@git.onedata.org:7999/vfs/bamboos.git) registered for path 'onezone_swagger/bamboos'
Cloning into '/mnt/storage/bamboo-agent-home/xml-data/build-dir/ODSRV-MAOPT-CAT3/onedata-acceptance/onezone_swagger/bamboos'...
error: failed to create clusterrolebinding: clusterrolebindings.rbac.authorization.k8s.io "serviceaccounts-cluster-admin" already exists
Unable to find image 'docker.onedata.org/swagger-aggregator:1.5.0' locally
1.5.0: Pulling from swagger-aggregator
3e51df1a11ab: Pulling fs layer
afe1a672db39: Pulling fs layer
80bad90eec10: Pulling fs layer
ca328de5836f: Pulling fs layer
4f4fb700ef54: Pulling fs layer
f9032f2640a0: Pulling fs layer
982a4aef97ed: Pulling fs layer
aca789ddad1c: Pulling fs layer
a3e17b3016f6: Pulling fs layer
b67d253c6e22: Pulling fs layer
302c9eabb2bb: Pulling fs layer
bb6e4824f633: Pulling fs layer
4f4fb700ef54: Waiting
f9032f2640a0: Waiting
b67d253c6e22: Waiting
302c9eabb2bb: Waiting
982a4aef97ed: Waiting
bb6e4824f633: Waiting
aca789ddad1c: Waiting
a3e17b3016f6: Waiting
ca328de5836f: Waiting
80bad90eec10: Verifying Checksum
80bad90eec10: Download complete
afe1a672db39: Verifying Checksum
afe1a672db39: Download complete
ca328de5836f: Verifying Checksum
ca328de5836f: Download complete
4f4fb700ef54: Verifying Checksum
4f4fb700ef54: Download complete
3e51df1a11ab: Download complete
aca789ddad1c: Verifying Checksum
aca789ddad1c: Download complete
a3e17b3016f6: Verifying Checksum
a3e17b3016f6: Download complete
b67d253c6e22: Verifying Checksum
b67d253c6e22: Download complete
302c9eabb2bb: Verifying Checksum
302c9eabb2bb: Download complete
bb6e4824f633: Verifying Checksum
bb6e4824f633: Download complete
982a4aef97ed: Verifying Checksum
982a4aef97ed: Download complete
3e51df1a11ab: Pull complete
afe1a672db39: Pull complete
80bad90eec10: Pull complete
ca328de5836f: Pull complete
4f4fb700ef54: Pull complete
f9032f2640a0: Verifying Checksum
f9032f2640a0: Download complete
f9032f2640a0: Pull complete
982a4aef97ed: Pull complete
aca789ddad1c: Pull complete
a3e17b3016f6: Pull complete
b67d253c6e22: Pull complete
302c9eabb2bb: Pull complete
bb6e4824f633: Pull complete
Digest: sha256:e2e8e762a03a0acdd49e63c4168157cb4e0e79f31f4e815561e9f4c65dbf8ac8
Status: Downloaded newer image for docker.onedata.org/swagger-aggregator:1.5.0
docker: Error response from daemon: No such image: docker.onedata.org/swagger-aggregator:1.5.0.
See 'docker run --help'.
make[1]: *** [Makefile:22: swagger.json] Error 125
make: *** [Makefile:134: build_swaggers] Error 2
tar: test-reports/results*.xml: Cannot stat: No such file or directory
tar: Exiting with failure status due to previous errors
cp: cannot stat 'onedata-acceptance/test-reports/*.xml': No such file or directory
cp: cannot stat 'onedata-acceptance/one_env/sources_info.yaml': No such file or directory
mv: cannot stat 'onedata-acceptance/tests/mixed/logs/report.*': No such file or directory
mv: cannot stat 'onedata-acceptance/tests/mixed/logs/gui_report/images.yaml': No such file or directory
% Total % Received % Xferd Average Speed Time Time Time Current
Dload Upload Total Spent Left Speed
0 0 0 0 0 0 0 0 --:--:-- --:--:-- --:--:-- 0
0 0 0 0 0 0 0 0 --:--:-- --:--:-- --:--:-- 0
100 4822 100 4822 0 0 46815 0 --:--:-- --:--:-- --:--:-- 46365
Error response from daemon: Cannot kill container: 32753428d301: Container 32753428d301596ce3d6ac6dda5032ffeeb4dcf39c66e422f27c82142adbeb43 is not running