Acceptance tests using different clients concurrently. Environment deployed from packages.
Build: #1554 failed
Job: Directories movement failed
user copies nonempty directory using client2 and using client1 sees that it has not changed[1oz 1op 1oc-web GUi-RESt]: Test case result
The below summarizes the result of the test " user copies nonempty directory using client2 and using client1 sees that it has not changed[1oz 1op 1oc-web GUi-RESt]" in build 1,554 of Onedata Products - mixed acceptance pkg - Chrome directories movement tests.
- Description
- user copies nonempty directory using client2 and using client1 sees that it has not changed[1oz 1op 1oc-web GUi-RESt]
- Test class
- mixed.scenarios.test_directories_movement
- Method
- test_user_copies_nonempty_directory_using_client2_and_using_client1_sees_that_it_has_not_changed[1oz_1op_1oc-web GUI-REST]
- Duration
- 1 min
- Status
- Failed (New Failure)
Error Log
RuntimeError: no with "Files" text found in Space in DataPage in Onezone page web_elem_root = <selenium.webdriver.chrome.webdriver.WebDriver (session="6c38e745fb2f30005ee9b40bc331f4a2")> css_sel = '.content-file-browser' err_msg = 'no item found in Oneprovider page' def find_web_elem(web_elem_root, css_sel, err_msg): try: _scroll_to_css_sel(web_elem_root, css_sel) > item = web_elem_root.find_element_by_css_selector(css_sel) tests/gui/utils/generic.py:93: _ _ _ _ _ _ _ _ _ _ _ _ _ _ _ _ _ _ _ _ _ _ _ _ _ _ _ _ _ _ _ _ _ _ _ _ _ _ _ _ self = <selenium.webdriver.chrome.webdriver.WebDriver (session="6c38e745fb2f30005ee9b40bc331f4a2")> css_selector = '.content-file-browser' def find_element_by_css_selector(self, css_selector): """ Finds an element by css selector. :Args: - css_selector - CSS selector string, ex: 'a.nav#home' :Returns: - WebElement - the element if it was found :Raises: - NoSuchElementException - if the element wasn't found :Usage: element = driver.find_element_by_css_selector('#foo') """ > return self.find_element(by=By.CSS_SELECTOR, value=css_selector) /usr/local/lib/python3.6/dist-packages/selenium/webdriver/remote/webdriver.py:597: _ _ _ _ _ _ _ _ _ _ _ _ _ _ _ _ _ _ _ _ _ _ _ _ _ _ _ _ _ _ _ _ _ _ _ _ _ _ _ _ self = <selenium.webdriver.chrome.webdriver.WebDriver (session="6c38e745fb2f30005ee9b40bc331f4a2")> by = 'css selector', value = '.content-file-browser' def find_element(self, by=By.ID, value=None): """ Find an element given a By strategy and locator. Prefer the find_element_by_* methods when possible. :Usage: element = driver.find_element(By.ID, 'foo') :rtype: WebElement """ if self.w3c: if by == By.ID: by = By.CSS_SELECTOR value = '[id="%s"]' % value elif by == By.TAG_NAME: by = By.CSS_SELECTOR elif by == By.CLASS_NAME: by = By.CSS_SELECTOR value = ".%s" % value elif by == By.NAME: by = By.CSS_SELECTOR value = '[name="%s"]' % value return self.execute(Command.FIND_ELEMENT, { 'using': by, > 'value': value})['value'] /usr/local/lib/python3.6/dist-packages/selenium/webdriver/remote/webdriver.py:966: _ _ _ _ _ _ _ _ _ _ _ _ _ _ _ _ _ _ _ _ _ _ _ _ _ _ _ _ _ _ _ _ _ _ _ _ _ _ _ _ self = <selenium.webdriver.chrome.webdriver.WebDriver (session="6c38e745fb2f30005ee9b40bc331f4a2")> driver_command = 'findElement' params = {'using': 'css selector', 'value': '.content-file-browser'} def execute(self, driver_command, params=None): """ Sends a command to be executed by a command.CommandExecutor. :Args: - driver_command: The name of the command to execute as a string. - params: A dictionary of named parameters to send with the command. :Returns: The command's JSON response loaded into a dictionary object. """ if self.session_id is not None: if not params: params = {'sessionId': self.session_id} elif 'sessionId' not in params: params['sessionId'] = self.session_id params = self._wrap_value(params) response = self.command_executor.execute(driver_command, params) if response: > self.error_handler.check_response(response) /usr/local/lib/python3.6/dist-packages/selenium/webdriver/remote/webdriver.py:320: _ _ _ _ _ _ _ _ _ _ _ _ _ _ _ _ _ _ _ _ _ _ _ _ _ _ _ _ _ _ _ _ _ _ _ _ _ _ _ _ self = <selenium.webdriver.remote.errorhandler.ErrorHandler object at 0x7fc63dc56dd8> response = {'status': 404, 'value': '{"value":{"error":"no such element","message":"no such element: Unable to locate element: {\...ntent-file-browser\\"}\\n (Session info: chrome=78.0.3904.70)","stacktrace":"#0 0x555eff4fd7e9 \\u003Cunknown>\\n"}}'} def check_response(self, response): """ Checks that a JSON response from the WebDriver does not have an error. :Args: - response - The JSON response from the WebDriver server as a dictionary object. :Raises: If the response contains an error message. """ status = response.get('status', None) if status is None or status == ErrorCode.SUCCESS: return value = None message = response.get("message", "") screen = response.get("screen", "") stacktrace = None if isinstance(status, int): value_json = response.get('value', None) if value_json and isinstance(value_json, basestring): import json try: value = json.loads(value_json) if len(value.keys()) == 1: value = value['value'] status = value.get('error', None) if status is None: status = value["status"] message = value["value"] if not isinstance(message, basestring): value = message message = message.get('message') else: message = value.get('message', None) except ValueError: pass exception_class = ErrorInResponseException if status in ErrorCode.NO_SUCH_ELEMENT: exception_class = NoSuchElementException elif status in ErrorCode.NO_SUCH_FRAME: exception_class = NoSuchFrameException elif status in ErrorCode.NO_SUCH_WINDOW: exception_class = NoSuchWindowException elif status in ErrorCode.STALE_ELEMENT_REFERENCE: exception_class = StaleElementReferenceException elif status in ErrorCode.ELEMENT_NOT_VISIBLE: exception_class = ElementNotVisibleException elif status in ErrorCode.INVALID_ELEMENT_STATE: exception_class = InvalidElementStateException elif status in ErrorCode.INVALID_SELECTOR \ or status in ErrorCode.INVALID_XPATH_SELECTOR \ or status in ErrorCode.INVALID_XPATH_SELECTOR_RETURN_TYPER: exception_class = InvalidSelectorException elif status in ErrorCode.ELEMENT_IS_NOT_SELECTABLE: exception_class = ElementNotSelectableException elif status in ErrorCode.ELEMENT_NOT_INTERACTABLE: exception_class = ElementNotInteractableException elif status in ErrorCode.INVALID_COOKIE_DOMAIN: exception_class = InvalidCookieDomainException elif status in ErrorCode.UNABLE_TO_SET_COOKIE: exception_class = UnableToSetCookieException elif status in ErrorCode.TIMEOUT: exception_class = TimeoutException elif status in ErrorCode.SCRIPT_TIMEOUT: exception_class = TimeoutException elif status in ErrorCode.UNKNOWN_ERROR: exception_class = WebDriverException elif status in ErrorCode.UNEXPECTED_ALERT_OPEN: exception_class = UnexpectedAlertPresentException elif status in ErrorCode.NO_ALERT_OPEN: exception_class = NoAlertPresentException elif status in ErrorCode.IME_NOT_AVAILABLE: exception_class = ImeNotAvailableException elif status in ErrorCode.IME_ENGINE_ACTIVATION_FAILED: exception_class = ImeActivationFailedException elif status in ErrorCode.MOVE_TARGET_OUT_OF_BOUNDS: exception_class = MoveTargetOutOfBoundsException elif status in ErrorCode.JAVASCRIPT_ERROR: exception_class = JavascriptException elif status in ErrorCode.SESSION_NOT_CREATED: exception_class = SessionNotCreatedException elif status in ErrorCode.INVALID_ARGUMENT: exception_class = InvalidArgumentException elif status in ErrorCode.NO_SUCH_COOKIE: exception_class = NoSuchCookieException elif status in ErrorCode.UNABLE_TO_CAPTURE_SCREEN: exception_class = ScreenshotException elif status in ErrorCode.ELEMENT_CLICK_INTERCEPTED: exception_class = ElementClickInterceptedException elif status in ErrorCode.INSECURE_CERTIFICATE: exception_class = InsecureCertificateException elif status in ErrorCode.INVALID_COORDINATES: exception_class = InvalidCoordinatesException elif status in ErrorCode.INVALID_SESSION_ID: exception_class = InvalidSessionIdException elif status in ErrorCode.UNKNOWN_METHOD: exception_class = UnknownMethodException else: exception_class = WebDriverException if value == '' or value is None: value = response['value'] if isinstance(value, basestring): if exception_class == ErrorInResponseException: raise exception_class(response, value) raise exception_class(value) if message == "" and 'message' in value: message = value['message'] screen = None if 'screen' in value: screen = value['screen'] stacktrace = None if 'stackTrace' in value and value['stackTrace']: stacktrace = [] try: for frame in value['stackTrace']: line = self._value_or_default(frame, 'lineNumber', '') file = self._value_or_default(frame, 'fileName', '<anonymous>') if line: file = "%s:%s" % (file, line) meth = self._value_or_default(frame, 'methodName', '<anonymous>') if 'className' in frame: meth = "%s.%s" % (frame['className'], meth) msg = " at %s (%s)" msg = msg % (meth, file) stacktrace.append(msg) except TypeError: pass if exception_class == ErrorInResponseException: raise exception_class(response, message) elif exception_class == UnexpectedAlertPresentException: alert_text = None if 'data' in value: alert_text = value['data'].get('text') elif 'alert' in value: alert_text = value['alert'].get('text') raise exception_class(message, screen, stacktrace, alert_text) > raise exception_class(message, screen, stacktrace) E selenium.common.exceptions.NoSuchElementException: Message: no such element: Unable to locate element: {"method":"css selector","selector":".content-file-browser"} E (Session info: chrome=78.0.3904.70) /usr/local/lib/python3.6/dist-packages/selenium/webdriver/remote/errorhandler.py:242: NoSuchElementException During handling of the above exception, another exception occurred: selenium = {'browser': <selenium.webdriver.chrome.webdriver.WebDriver (session="6c38e745fb2f30005ee9b40bc331f4a2")>, 'user1': <selenium.webdriver.chrome.webdriver.WebDriver (session="6c38e745fb2f30005ee9b40bc331f4a2")>} browser_id = 'user1', path = '', item_type = 'directory', name = 'dir1' tmp_memory = defaultdict(<class 'dict'>, {'user1': {'shares': {}, 'spaces': {}, 'groups': {}, 'mailbox': {}, 'oz': {}, 'window': {'...l': None}}, 'browser': {'shares': {}, 'spaces': {}, 'groups': {}, 'mailbox': {}, 'oz': {}, 'window': {'modal': None}}}) op_container = <class 'tests.gui.utils.oneprovider.OPLoggedIn'> res = 'succeeds', space = 'space1' modals = <class 'tests.gui.utils.common.modals.Modals'> oz_page = <class 'tests.gui.utils.onezone.OZLoggedIn'> @wt(parsers.re(r'user of (?P<browser_id>\w+) (?P<res>.*) to create ' r'(?P<item_type>directory) "(?P<name>[\w._-]+)" ' '(in "(?P<path>.*)" )?in "(?P<space>.*)"')) def create_item_in_op_gui(selenium, browser_id, path, item_type, name, tmp_memory, op_container, res, space, modals, oz_page): # change None to empty string if path not given path = path.lstrip('/') if path else '' button = f'New {item_type}' modal_header = f'Create new {item_type}:' modal_name = 'Create dir' text = 'Creating directory failed' option = 'enter' def _open_menu_for_item_in_file_browser(): if path: go_to_path(browser_id, tmp_memory, path) click_button_from_file_browser_menu_bar(selenium, browser_id, button, op_container) try: > _open_menu_for_item_in_file_browser() tests/gui/meta_steps/oneprovider/data.py:137: _ _ _ _ _ _ _ _ _ _ _ _ _ _ _ _ _ _ _ _ _ _ _ _ _ _ _ _ _ _ _ _ _ _ _ _ _ _ _ _ def _open_menu_for_item_in_file_browser(): if path: go_to_path(browser_id, tmp_memory, path) click_button_from_file_browser_menu_bar(selenium, browser_id, > button, op_container) tests/gui/meta_steps/oneprovider/data.py:134: _ _ _ _ _ _ _ _ _ _ _ _ _ _ _ _ _ _ _ _ _ _ _ _ _ _ _ _ _ _ _ _ _ _ _ _ _ _ _ _ args = ({'browser': <selenium.webdriver.chrome.webdriver.WebDriver (session="6c38e745fb2f30005ee9b40bc331f4a2")>, 'user1': <s...sion="6c38e745fb2f30005ee9b40bc331f4a2")>}, 'user1', 'New directory', <class 'tests.gui.utils.oneprovider.OPLoggedIn'>) kwargs = {} ba = <BoundArguments (selenium={'user1': <selenium.webdriver.chrome.webdriver.WebDriver (session="6c38e745fb2f30005ee9b40bc...31f4a2")>}, browser_id='user1', button='New directory', op_container=<class 'tests.gui.utils.oneprovider.OPLoggedIn'>)> param = <Parameter "op_container">, ann = <class 'inspect._empty'> @wraps(fun) def wrapper(*args, **kwargs): ba = sig.bind(*args, **kwargs) ba.apply_defaults() for param in parameters.values(): ann = param.annotation if ann is not inspect.Parameter.empty: value = ba.arguments[param.name] try: if not isinstance(value, ann): ba.arguments[param.name] = ann(value) except Exception as ex: msg = f"Cannot cast '{param.name}' <{value}> to {ann}" raise ValueError(msg) from ex > return fun(*ba.args, **ba.kwargs) tests/utils/bdd_utils.py:77: _ _ _ _ _ _ _ _ _ _ _ _ _ _ _ _ _ _ _ _ _ _ _ _ _ _ _ _ _ _ _ _ _ _ _ _ _ _ _ _ selenium = {'browser': <selenium.webdriver.chrome.webdriver.WebDriver (session="6c38e745fb2f30005ee9b40bc331f4a2")>, 'user1': <selenium.webdriver.chrome.webdriver.WebDriver (session="6c38e745fb2f30005ee9b40bc331f4a2")>} browser_id = 'user1', button = 'New directory' op_container = <class 'tests.gui.utils.oneprovider.OPLoggedIn'> > ??? <decorator-gen-353>:2: _ _ _ _ _ _ _ _ _ _ _ _ _ _ _ _ _ _ _ _ _ _ _ _ _ _ _ _ _ _ _ _ _ _ _ _ _ _ _ _ fun = <function click_button_from_file_browser_menu_bar at 0x7fc63f847a60> args = ({'browser': <selenium.webdriver.chrome.webdriver.WebDriver (session="6c38e745fb2f30005ee9b40bc331f4a2")>, 'user1': <s...sion="6c38e745fb2f30005ee9b40bc331f4a2")>}, 'user1', 'New directory', <class 'tests.gui.utils.oneprovider.OPLoggedIn'>) kwargs = {}, now = 1621606072.43349, limit = 1621606076.43349 i = 1621606076.6260083 @decorator def wrapper(fun, *args, **kwargs): now = time() limit, i = (now + timeout, now) if timeout else (attempts, 0) while i < limit: try: result = fun(*args, **kwargs) except exceptions: sleep(interval) i = time() if timeout else i+1 continue else: return result > return fun(*args, **kwargs) tests/utils/utils.py:90: _ _ _ _ _ _ _ _ _ _ _ _ _ _ _ _ _ _ _ _ _ _ _ _ _ _ _ _ _ _ _ _ _ _ _ _ _ _ _ _ selenium = {'browser': <selenium.webdriver.chrome.webdriver.WebDriver (session="6c38e745fb2f30005ee9b40bc331f4a2")>, 'user1': <selenium.webdriver.chrome.webdriver.WebDriver (session="6c38e745fb2f30005ee9b40bc331f4a2")>} browser_id = 'user1', button = 'new_directory_button' op_container = <class 'tests.gui.utils.oneprovider.OPLoggedIn'> @wt(parsers.re('user of (?P<browser_id>.*?) clicks ' '"(?P<button>New directory|Upload files|Refresh|Paste)" button ' 'from file browser menu bar')) @repeat_failed(timeout=WAIT_FRONTEND) def click_button_from_file_browser_menu_bar(selenium, browser_id, button, op_container): driver = selenium[browser_id] button = transform(button) + '_button' > getattr(op_container(driver).file_browser, transform(button)).click() tests/gui/steps/oneprovider/data_tab.py:73: _ _ _ _ _ _ _ _ _ _ _ _ _ _ _ _ _ _ _ _ _ _ _ _ _ _ _ _ _ _ _ _ _ _ _ _ _ _ _ _ self = <tests.gui.utils.core.web_elements.WebItem object at 0x7fc63fbc2358> instance = <tests.gui.utils.oneprovider.OPLoggedIn object at 0x7fc63dfb4e48> owner = <class 'tests.gui.utils.oneprovider.OPLoggedIn'> def __get__(self, instance, owner): > elem = super(WebItem, self).__get__(instance, owner) tests/gui/utils/core/web_elements.py:58: _ _ _ _ _ _ _ _ _ _ _ _ _ _ _ _ _ _ _ _ _ _ _ _ _ _ _ _ _ _ _ _ _ _ _ _ _ _ _ _ self = <tests.gui.utils.core.web_elements.WebItem object at 0x7fc63fbc2358> instance = <tests.gui.utils.oneprovider.OPLoggedIn object at 0x7fc63dfb4e48> owner = <class 'tests.gui.utils.oneprovider.OPLoggedIn'> def __get__(self, instance, owner): if instance is None: return self return find_web_elem(instance.web_elem, self.css_sel, > lambda: self._format_msg('no {item} item found ' 'in {parent}', instance)) tests/gui/utils/core/web_elements.py:29: _ _ _ _ _ _ _ _ _ _ _ _ _ _ _ _ _ _ _ _ _ _ _ _ _ _ _ _ _ _ _ _ _ _ _ _ _ _ _ _ web_elem_root = <selenium.webdriver.chrome.webdriver.WebDriver (session="6c38e745fb2f30005ee9b40bc331f4a2")> css_sel = '.content-file-browser' err_msg = 'no item found in Oneprovider page' def find_web_elem(web_elem_root, css_sel, err_msg): try: _scroll_to_css_sel(web_elem_root, css_sel) item = web_elem_root.find_element_by_css_selector(css_sel) except NoSuchElementException: with suppress(TypeError): err_msg = err_msg() > raise RuntimeError(err_msg) E RuntimeError: no item found in Oneprovider page tests/gui/utils/generic.py:97: RuntimeError During handling of the above exception, another exception occurred: request = <FixtureRequest for <Function 'test_user_copies_nonempty_directory_using_client2_and_using_client1_sees_that_it_has_not_changed[1oz_1op_1oc-web GUI-REST]'>> @pytest.mark.usefixtures(*function_args) def scenario_wrapper(request): > _execute_scenario(feature, scenario, request, encoding) /usr/local/lib/python3.6/dist-packages/pytest_bdd/scenario.py:227: _ _ _ _ _ _ _ _ _ _ _ _ _ _ _ _ _ _ _ _ _ _ _ _ _ _ _ _ _ _ _ _ _ _ _ _ _ _ _ _ /usr/local/lib/python3.6/dist-packages/pytest_bdd/scenario.py:189: in _execute_scenario _execute_step_function(request, scenario, step, step_func) /usr/local/lib/python3.6/dist-packages/pytest_bdd/scenario.py:130: in _execute_step_function step_func(**kwargs) tests/utils/bdd_utils.py:77: in wrapper return fun(*ba.args, **ba.kwargs) tests/mixed/steps/data_basic.py:411: in create_directory_structure_in_op modals, oz_page, popups) tests/gui/meta_steps/oneprovider/data.py:271: in create_directory_structure_in_op_gui op_container, modals, oz_page, popups) tests/gui/meta_steps/oneprovider/data.py:302: in _create_content tmp_memory, op_container, modals, oz_page, popups) tests/gui/meta_steps/oneprovider/data.py:280: in _create_item modals, oz_page) tests/utils/bdd_utils.py:77: in wrapper return fun(*ba.args, **ba.kwargs) tests/gui/meta_steps/oneprovider/data.py:140: in create_item_in_op_gui tmp_memory, space) tests/utils/bdd_utils.py:77: in wrapper return fun(*ba.args, **ba.kwargs) tests/gui/meta_steps/oneprovider/data.py:396: in go_to_filebrowser oz_page) tests/utils/bdd_utils.py:77: in wrapper return fun(*ba.args, **ba.kwargs) <decorator-gen-635>:2: in click_on_option_of_space_on_left_sidebar_menu ??? tests/utils/utils.py:90: in wrapper return fun(*args, **kwargs) tests/gui/steps/onezone/spaces.py:272: in click_on_option_of_space_on_left_sidebar_menu transform(option)).click() tests/gui/utils/core/web_elements.py:58: in __get__ elem = super(WebItem, self).__get__(instance, owner) tests/gui/utils/core/web_elements.py:52: in __get__ lambda: self._format_msg(err_msg, instance, _ _ _ _ _ _ _ _ _ _ _ _ _ _ _ _ _ _ _ _ _ _ _ _ _ _ _ _ _ _ _ _ _ _ _ _ _ _ _ _ web_elem_root = <selenium.webdriver.remote.webelement.WebElement (session="6c38e745fb2f30005ee9b40bc331f4a2", element="7a704e74-dc8d-451a-851f-45c4dca3cab0")> css_sel = '.one-list-level-2 .item-header', text = 'Files' err_msg = 'no with "Files" text found in Space in DataPage in Onezone page' def find_web_elem_with_text(web_elem_root, css_sel, text, err_msg): items = web_elem_root.find_elements_by_css_selector(css_sel) _scroll_to_css_sel(web_elem_root, css_sel) for item in items: if item.text.lower() == text.lower(): return item else: with suppress(TypeError): err_msg = err_msg() > raise RuntimeError(err_msg) E RuntimeError: no with "Files" text found in Space in DataPage in Onezone page tests/gui/utils/generic.py:111: RuntimeError