GUI acceptance tests using environment deployed from packages.
Build: #1796 failed
Job: Chrome onepanel deployment ceph failed
Job result summary
- Completed
- Duration
- 3 minutes
- Revision
-
cb986cfdd816752531de1494e93cb1804527e01b
- Failing since
- #1754 (Manual run by MichaĆ Wrzeszcz – )
- Fixed in
- #1817 (Changes by Jakub Liput)
Configuration changes
Error summary
The build generated some errors. See the full build log for more details.
% Total % Received % Xferd Average Speed Time Time Time Current
Dload Upload Total Spent Left Speed
0 0 0 0 0 0 0 0 --:--:-- --:--:-- --:--:-- 0
100 4653 100 4653 0 0 47969 0 --:--:-- --:--:-- --:--:-- 47969
Error response from daemon: Cannot kill container: adaf90d27c6d: Container adaf90d27c6d3603a0d46a201a97a9c36b3eb630ee1f560f65433b92b6593aa3 is not running
Submodule 'bamboos' (ssh://git@git.onedata.org:7999/vfs/bamboos.git) registered for path 'bamboos'
Submodule 'cdmi_swagger' (ssh://git@git.onedata.org:7999/vfs/cdmi-swagger.git) registered for path 'cdmi_swagger'
Submodule 'one_env' (ssh://git@git.onedata.org:7999/vfs/one-env.git) registered for path 'one_env'
Submodule 'onepanel_swagger' (ssh://git@git.onedata.org:7999/vfs/onepanel-swagger.git) registered for path 'onepanel_swagger'
Submodule 'oneprovider_swagger' (ssh://git@git.onedata.org:7999/vfs/oneprovider-swagger.git) registered for path 'oneprovider_swagger'
Submodule 'onezone_swagger' (ssh://git@git.onedata.org:7999/vfs/onezone-swagger.git) registered for path 'onezone_swagger'
Cloning into '/mnt/storage/bamboo-agent-home/xml-data/build-dir/ODSRV-GAPT-CODC/onedata/bamboos'...
Cloning into '/mnt/storage/bamboo-agent-home/xml-data/build-dir/ODSRV-GAPT-CODC/onedata/cdmi_swagger'...
Cloning into '/mnt/storage/bamboo-agent-home/xml-data/build-dir/ODSRV-GAPT-CODC/onedata/one_env'...
Cloning into '/mnt/storage/bamboo-agent-home/xml-data/build-dir/ODSRV-GAPT-CODC/onedata/onepanel_swagger'...
Cloning into '/mnt/storage/bamboo-agent-home/xml-data/build-dir/ODSRV-GAPT-CODC/onedata/oneprovider_swagger'...
Cloning into '/mnt/storage/bamboo-agent-home/xml-data/build-dir/ODSRV-GAPT-CODC/onedata/onezone_swagger'...
Submodule 'bamboos' (ssh://git@git.onedata.org:7999/vfs/bamboos.git) registered for path 'onepanel_swagger/bamboos'
Cloning into '/mnt/storage/bamboo-agent-home/xml-data/build-dir/ODSRV-GAPT-CODC/onedata/onepanel_swagger/bamboos'...
Submodule 'bamboos' (ssh://git@git.onedata.org:7999/vfs/bamboos.git) registered for path 'oneprovider_swagger/bamboos'
Cloning into '/mnt/storage/bamboo-agent-home/xml-data/build-dir/ODSRV-GAPT-CODC/onedata/oneprovider_swagger/bamboos'...
Submodule 'bamboos' (ssh://git@git.onedata.org:7999/vfs/bamboos.git) registered for path 'onezone_swagger/bamboos'
Cloning into '/mnt/storage/bamboo-agent-home/xml-data/build-dir/ODSRV-GAPT-CODC/onedata/onezone_swagger/bamboos'...
error: failed to create clusterrolebinding: clusterrolebindings.rbac.authorization.k8s.io "serviceaccounts-cluster-admin" already exists
File "/usr/local/lib/python3.6/dist-packages/selenium/webdriver/remote/remote_connection.py", line 375 in execute
File "/usr/local/lib/python3.6/dist-packages/selenium/webdriver/remote/webdriver.py", line 318 in execute
File "/usr/local/lib/python3.6/dist-packages/selenium/webdriver/remote/webdriver.py", line 635 in execute_script
File "/mnt/storage/bamboo-agent-home/xml-data/build-dir/ODSRV-GAPT-CODC/onedata/tests/gui/utils/generic.py", line 136 in _scroll_to_css_sel
File "/mnt/storage/bamboo-agent-home/xml-data/build-dir/ODSRV-GAPT-CODC/onedata/tests/gui/utils/generic.py", line 92 in find_web_elem
File "/mnt/storage/bamboo-agent-home/xml-data/build-dir/ODSRV-GAPT-CODC/onedata/tests/gui/utils/core/web_elements.py", line 29 in __get__
File "/mnt/storage/bamboo-agent-home/xml-data/build-dir/ODSRV-GAPT-CODC/onedata/tests/gui/utils/core/web_elements.py", line 76 in __get__
File "/mnt/storage/bamboo-agent-home/xml-data/build-dir/ODSRV-GAPT-CODC/onedata/tests/gui/utils/common/common.py", line 52 in __str__
File "/mnt/storage/bamboo-agent-home/xml-data/build-dir/ODSRV-GAPT-CODC/onedata/tests/gui/utils/core/web_elements.py", line 34 in _format_msg
File "/mnt/storage/bamboo-agent-home/xml-data/build-dir/ODSRV-GAPT-CODC/onedata/tests/gui/utils/core/web_elements.py", line 30 in <lambda>
File "/mnt/storage/bamboo-agent-home/xml-data/build-dir/ODSRV-GAPT-CODC/onedata/tests/gui/utils/generic.py", line 96 in find_web_elem
File "/mnt/storage/bamboo-agent-home/xml-data/build-dir/ODSRV-GAPT-CODC/onedata/tests/gui/utils/core/web_elements.py", line 29 in __get__
File "/mnt/storage/bamboo-agent-home/xml-data/build-dir/ODSRV-GAPT-CODC/onedata/tests/gui/utils/core/web_elements.py", line 76 in __get__
File "/mnt/storage/bamboo-agent-home/xml-data/build-dir/ODSRV-GAPT-CODC/onedata/tests/gui/utils/common/common.py", line 52 in __str__
File "/mnt/storage/bamboo-agent-home/xml-data/build-dir/ODSRV-GAPT-CODC/onedata/tests/gui/utils/core/web_elements.py", line 34 in _format_msg
File "/mnt/storage/bamboo-agent-home/xml-data/build-dir/ODSRV-GAPT-CODC/onedata/tests/gui/utils/core/web_elements.py", line 30 in <lambda>
File "/mnt/storage/bamboo-agent-home/xml-data/build-dir/ODSRV-GAPT-CODC/onedata/tests/gui/utils/generic.py", line 96 in find_web_elem
File "/mnt/storage/bamboo-agent-home/xml-data/build-dir/ODSRV-GAPT-CODC/onedata/tests/gui/utils/core/web_elements.py", line 29 in __get__
File "/mnt/storage/bamboo-agent-home/xml-data/build-dir/ODSRV-GAPT-CODC/onedata/tests/gui/utils/core/web_elements.py", line 76 in __get__
File "/mnt/storage/bamboo-agent-home/xml-data/build-dir/ODSRV-GAPT-CODC/onedata/tests/gui/utils/common/common.py", line 52 in __str__
File "/mnt/storage/bamboo-agent-home/xml-data/build-dir/ODSRV-GAPT-CODC/onedata/tests/gui/utils/core/web_elements.py", line 34 in _format_msg
File "/mnt/storage/bamboo-agent-home/xml-data/build-dir/ODSRV-GAPT-CODC/onedata/tests/gui/utils/core/web_elements.py", line 30 in <lambda>
File "/mnt/storage/bamboo-agent-home/xml-data/build-dir/ODSRV-GAPT-CODC/onedata/tests/gui/utils/generic.py", line 96 in find_web_elem
File "/mnt/storage/bamboo-agent-home/xml-data/build-dir/ODSRV-GAPT-CODC/onedata/tests/gui/utils/core/web_elements.py", line 29 in __get__
File "/mnt/storage/bamboo-agent-home/xml-data/build-dir/ODSRV-GAPT-CODC/onedata/tests/gui/utils/core/web_elements.py", line 76 in __get__
File "/mnt/storage/bamboo-agent-home/xml-data/build-dir/ODSRV-GAPT-CODC/onedata/tests/gui/utils/common/common.py", line 52 in __str__
File "/mnt/storage/bamboo-agent-home/xml-data/build-dir/ODSRV-GAPT-CODC/onedata/tests/gui/utils/core/web_elements.py", line 34 in _format_msg
File "/mnt/storage/bamboo-agent-home/xml-data/build-dir/ODSRV-GAPT-CODC/onedata/tests/gui/utils/core/web_elements.py", line 30 in <lambda>
File "/mnt/storage/bamboo-agent-home/xml-data/build-dir/ODSRV-GAPT-CODC/onedata/tests/gui/utils/generic.py", line 96 in find_web_elem
File "/mnt/storage/bamboo-agent-home/xml-data/build-dir/ODSRV-GAPT-CODC/onedata/tests/gui/utils/core/web_elements.py", line 29 in __get__
File "/mnt/storage/bamboo-agent-home/xml-data/build-dir/ODSRV-GAPT-CODC/onedata/tests/gui/utils/core/web_elements.py", line 76 in __get__
File "/mnt/storage/bamboo-agent-home/xml-data/build-dir/ODSRV-GAPT-CODC/onedata/tests/gui/utils/common/common.py", line 52 in __str__
File "/mnt/storage/bamboo-agent-home/xml-data/build-dir/ODSRV-GAPT-CODC/onedata/tests/gui/utils/core/web_elements.py", line 34 in _format_msg
File "/mnt/storage/bamboo-agent-home/xml-data/build-dir/ODSRV-GAPT-CODC/onedata/tests/gui/utils/core/web_elements.py", line 30 in <lambda>
File "/mnt/storage/bamboo-agent-home/xml-data/build-dir/ODSRV-GAPT-CODC/onedata/tests/gui/utils/generic.py", line 96 in find_web_elem
File "/mnt/storage/bamboo-agent-home/xml-data/build-dir/ODSRV-GAPT-CODC/onedata/tests/gui/utils/core/web_elements.py", line 29 in __get__
File "/mnt/storage/bamboo-agent-home/xml-data/build-dir/ODSRV-GAPT-CODC/onedata/tests/gui/utils/core/web_elements.py", line 76 in __get__
File "/mnt/storage/bamboo-agent-home/xml-data/build-dir/ODSRV-GAPT-CODC/onedata/tests/gui/utils/common/common.py", line 52 in __str__
File "/mnt/storage/bamboo-agent-home/xml-data/build-dir/ODSRV-GAPT-CODC/onedata/tests/gui/utils/core/web_elements.py", line 34 in _format_msg
File "/mnt/storage/bamboo-agent-home/xml-data/build-dir/ODSRV-GAPT-CODC/onedata/tests/gui/utils/core/web_elements.py", line 30 in <lambda>
File "/mnt/storage/bamboo-agent-home/xml-data/build-dir/ODSRV-GAPT-CODC/onedata/tests/gui/utils/generic.py", line 96 in find_web_elem
File "/mnt/storage/bamboo-agent-home/xml-data/build-dir/ODSRV-GAPT-CODC/onedata/tests/gui/utils/core/web_elements.py", line 29 in __get__
File "/mnt/storage/bamboo-agent-home/xml-data/build-dir/ODSRV-GAPT-CODC/onedata/tests/gui/utils/core/web_elements.py", line 76 in __get__
File "/mnt/storage/bamboo-agent-home/xml-data/build-dir/ODSRV-GAPT-CODC/onedata/tests/gui/utils/common/common.py", line 52 in __str__
File "/mnt/storage/bamboo-agent-home/xml-data/build-dir/ODSRV-GAPT-CODC/onedata/tests/gui/utils/core/web_elements.py", line 34 in _format_msg
File "/mnt/storage/bamboo-agent-home/xml-data/build-dir/ODSRV-GAPT-CODC/onedata/tests/gui/utils/core/web_elements.py", line 30 in <lambda>
File "/mnt/storage/bamboo-agent-home/xml-data/build-dir/ODSRV-GAPT-CODC/onedata/tests/gui/utils/generic.py", line 96 in find_web_elem
File "/mnt/storage/bamboo-agent-home/xml-data/build-dir/ODSRV-GAPT-CODC/onedata/tests/gui/utils/core/web_elements.py", line 29 in __get__
File "/mnt/storage/bamboo-agent-home/xml-data/build-dir/ODSRV-GAPT-CODC/onedata/tests/gui/utils/core/web_elements.py", line 76 in __get__
File "/mnt/storage/bamboo-agent-home/xml-data/build-dir/ODSRV-GAPT-CODC/onedata/tests/gui/utils/common/common.py", line 52 in __str__
File "/mnt/storage/bamboo-agent-home/xml-data/build-dir/ODSRV-GAPT-CODC/onedata/tests/gui/utils/core/web_elements.py", line 34 in _format_msg
File "/mnt/storage/bamboo-agent-home/xml-data/build-dir/ODSRV-GAPT-CODC/onedata/tests/gui/utils/core/web_elements.py", line 30 in <lambda>
File "/mnt/storage/bamboo-agent-home/xml-data/build-dir/ODSRV-GAPT-CODC/onedata/tests/gui/utils/generic.py", line 96 in find_web_elem
File "/mnt/storage/bamboo-agent-home/xml-data/build-dir/ODSRV-GAPT-CODC/onedata/tests/gui/utils/core/web_elements.py", line 29 in __get__
File "/mnt/storage/bamboo-agent-home/xml-data/build-dir/ODSRV-GAPT-CODC/onedata/tests/gui/utils/core/web_elements.py", line 76 in __get__
File "/mnt/storage/bamboo-agent-home/xml-data/build-dir/ODSRV-GAPT-CODC/onedata/tests/gui/utils/common/common.py", line 52 in __str__
File "/mnt/storage/bamboo-agent-home/xml-data/build-dir/ODSRV-GAPT-CODC/onedata/tests/gui/utils/core/web_elements.py", line 34 in _format_msg
File "/mnt/storage/bamboo-agent-home/xml-data/build-dir/ODSRV-GAPT-CODC/onedata/tests/gui/utils/core/web_elements.py", line 30 in <lambda>
File "/mnt/storage/bamboo-agent-home/xml-data/build-dir/ODSRV-GAPT-CODC/onedata/tests/gui/utils/generic.py", line 96 in find_web_elem
File "/mnt/storage/bamboo-agent-home/xml-data/build-dir/ODSRV-GAPT-CODC/onedata/tests/gui/utils/core/web_elements.py", line 29 in __get__
File "/mnt/storage/bamboo-agent-home/xml-data/build-dir/ODSRV-GAPT-CODC/onedata/tests/gui/utils/core/web_elements.py", line 76 in __get__
File "/mnt/storage/bamboo-agent-home/xml-data/build-dir/ODSRV-GAPT-CODC/onedata/tests/gui/utils/common/common.py", line 52 in __str__
File "/mnt/storage/bamboo-agent-home/xml-data/build-dir/ODSRV-GAPT-CODC/onedata/tests/gui/utils/core/web_elements.py", line 34 in _format_msg
File "/mnt/storage/bamboo-agent-home/xml-data/build-dir/ODSRV-GAPT-CODC/onedata/tests/gui/utils/core/web_elements.py", line 30 in <lambda>
File "/mnt/storage/bamboo-agent-home/xml-data/build-dir/ODSRV-GAPT-CODC/onedata/tests/gui/utils/generic.py", line 96 in find_web_elem
File "/mnt/storage/bamboo-agent-home/xml-data/build-dir/ODSRV-GAPT-CODC/onedata/tests/gui/utils/core/web_elements.py", line 29 in __get__
File "/mnt/storage/bamboo-agent-home/xml-data/build-dir/ODSRV-GAPT-CODC/onedata/tests/gui/utils/core/web_elements.py", line 76 in __get__
File "/mnt/storage/bamboo-agent-home/xml-data/build-dir/ODSRV-GAPT-CODC/onedata/tests/gui/utils/common/common.py", line 52 in __str__
File "/mnt/storage/bamboo-agent-home/xml-data/build-dir/ODSRV-GAPT-CODC/onedata/tests/gui/utils/core/web_elements.py", line 34 in _format_msg
File "/mnt/storage/bamboo-agent-home/xml-data/build-dir/ODSRV-GAPT-CODC/onedata/tests/gui/utils/core/web_elements.py", line 30 in <lambda>
File "/mnt/storage/bamboo-agent-home/xml-data/build-dir/ODSRV-GAPT-CODC/onedata/tests/gui/utils/generic.py", line 96 in find_web_elem
File "/mnt/storage/bamboo-agent-home/xml-data/build-dir/ODSRV-GAPT-CODC/onedata/tests/gui/utils/core/web_elements.py", line 29 in __get__
File "/mnt/storage/bamboo-agent-home/xml-data/build-dir/ODSRV-GAPT-CODC/onedata/tests/gui/utils/core/web_elements.py", line 76 in __get__
File "/mnt/storage/bamboo-agent-home/xml-data/build-dir/ODSRV-GAPT-CODC/onedata/tests/gui/utils/common/common.py", line 52 in __str__
File "/mnt/storage/bamboo-agent-home/xml-data/build-dir/ODSRV-GAPT-CODC/onedata/tests/gui/utils/core/web_elements.py", line 34 in _format_msg
File "/mnt/storage/bamboo-agent-home/xml-data/build-dir/ODSRV-GAPT-CODC/onedata/tests/gui/utils/core/web_elements.py", line 30 in <lambda>
File "/mnt/storage/bamboo-agent-home/xml-data/build-dir/ODSRV-GAPT-CODC/onedata/tests/gui/utils/generic.py", line 96 in find_web_elem
File "/mnt/storage/bamboo-agent-home/xml-data/build-dir/ODSRV-GAPT-CODC/onedata/tests/gui/utils/core/web_elements.py", line 29 in __get__
File "/mnt/storage/bamboo-agent-home/xml-data/build-dir/ODSRV-GAPT-CODC/onedata/tests/gui/utils/core/web_elements.py", line 76 in __get__
File "/mnt/storage/bamboo-agent-home/xml-data/build-dir/ODSRV-GAPT-CODC/onedata/tests/gui/utils/common/common.py", line 52 in __str__
File "/mnt/storage/bamboo-agent-home/xml-data/build-dir/ODSRV-GAPT-CODC/onedata/tests/gui/utils/core/web_elements.py", line 34 in _format_msg
File "/mnt/storage/bamboo-agent-home/xml-data/build-dir/ODSRV-GAPT-CODC/onedata/tests/gui/utils/core/web_elements.py", line 30 in <lambda>
File "/mnt/storage/bamboo-agent-home/xml-data/build-dir/ODSRV-GAPT-CODC/onedata/tests/gui/utils/generic.py", line 96 in find_web_elem
File "/mnt/storage/bamboo-agent-home/xml-data/build-dir/ODSRV-GAPT-CODC/onedata/tests/gui/utils/core/web_elements.py", line 29 in __get__
File "/mnt/storage/bamboo-agent-home/xml-data/build-dir/ODSRV-GAPT-CODC/onedata/tests/gui/utils/core/web_elements.py", line 76 in __get__
File "/mnt/storage/bamboo-agent-home/xml-data/build-dir/ODSRV-GAPT-CODC/onedata/tests/gui/utils/common/common.py", line 52 in __str__
File "/mnt/storage/bamboo-agent-home/xml-data/build-dir/ODSRV-GAPT-CODC/onedata/tests/gui/utils/core/web_elements.py", line 34 in _format_msg
File "/mnt/storage/bamboo-agent-home/xml-data/build-dir/ODSRV-GAPT-CODC/onedata/tests/gui/utils/core/web_elements.py", line 30 in <lambda>
File "/mnt/storage/bamboo-agent-home/xml-data/build-dir/ODSRV-GAPT-CODC/onedata/tests/gui/utils/generic.py", line 96 in find_web_elem
File "/mnt/storage/bamboo-agent-home/xml-data/build-dir/ODSRV-GAPT-CODC/onedata/tests/gui/utils/core/web_elements.py", line 29 in __get__
...
Traceback (most recent call last):
File "./test_run.py", line 351, in <module>
main()
File "./test_run.py", line 344, in main
if env_errors_exists(report):
File "./test_run.py", line 61, in env_errors_exists
testcases = testsuite.findall('testcase')
AttributeError: 'NoneType' object has no attribute 'findall'
make: *** [Makefile:89: test_gui_pkg] Error 1
cp: cannot stat 'onedata/test-reports/*.xml': No such file or directory
cp: cannot stat 'onedata/one_env/sources_info.yaml': No such file or directory
% Total % Received % Xferd Average Speed Time Time Time Current
Dload Upload Total Spent Left Speed
0 0 0 0 0 0 0 0 --:--:-- --:--:-- --:--:-- 0
100 4653 100 4653 0 0 47969 0 --:--:-- --:--:-- --:--:-- 47969
Error response from daemon: Cannot kill container: 71ce6430bc0d: Container 71ce6430bc0d34ea2892af672f9bd00862f47d0731841876ff4b9de857b7bd40 is not running
Error response from daemon: Cannot kill container: 7dafbb109b7b: Container 7dafbb109b7b12c683aec09174d3622584df6544ce8054ff589fadb433d0a68c is not running
Error response from daemon: Cannot kill container: d7c5e2b0208d: Container d7c5e2b0208d12513b04325a2520cf5725cefeeb9bac3554449ab32011078d47 is not running
Error response from daemon: Cannot kill container: d46cc51b14fa: Container d46cc51b14fa93eb1c0aa6980a1f5ed230994e6c4663ac9f1863fad3cb380317 is not running
Error response from daemon: Cannot kill container: f951c18f3346: Container f951c18f33469677cd0815223c844e30608383c39a660df4a69a4aa89d6ecc86 is not running
Error response from daemon: Cannot kill container: 14747a0dd5cd: Container 14747a0dd5cdfa8237b5e069b2f45a3727a7757153522c2680f9b8e1156052e4 is not running
Error response from daemon: Cannot kill container: cb3537395bc6: Container cb3537395bc60535f5b1887f62a8c79de8b83f9c0ac4a08e9f4b2535487d6ca6 is not running
Error response from daemon: Cannot kill container: f587911af352: Container f587911af35265382f86f76fb5909c86b60a26d6f918f021e79b4485e5d550d4 is not running
Error response from daemon: Cannot kill container: ac8cef2977ea: Container ac8cef2977ead86dd642ecae6daaa49429e1db79bdf3252e4220d5896ff9e4d1 is not running
Dload Upload Total Spent Left Speed
0 0 0 0 0 0 0 0 --:--:-- --:--:-- --:--:-- 0
100 4653 100 4653 0 0 47969 0 --:--:-- --:--:-- --:--:-- 47969
Error response from daemon: Cannot kill container: adaf90d27c6d: Container adaf90d27c6d3603a0d46a201a97a9c36b3eb630ee1f560f65433b92b6593aa3 is not running
Submodule 'bamboos' (ssh://git@git.onedata.org:7999/vfs/bamboos.git) registered for path 'bamboos'
Submodule 'cdmi_swagger' (ssh://git@git.onedata.org:7999/vfs/cdmi-swagger.git) registered for path 'cdmi_swagger'
Submodule 'one_env' (ssh://git@git.onedata.org:7999/vfs/one-env.git) registered for path 'one_env'
Submodule 'onepanel_swagger' (ssh://git@git.onedata.org:7999/vfs/onepanel-swagger.git) registered for path 'onepanel_swagger'
Submodule 'oneprovider_swagger' (ssh://git@git.onedata.org:7999/vfs/oneprovider-swagger.git) registered for path 'oneprovider_swagger'
Submodule 'onezone_swagger' (ssh://git@git.onedata.org:7999/vfs/onezone-swagger.git) registered for path 'onezone_swagger'
Cloning into '/mnt/storage/bamboo-agent-home/xml-data/build-dir/ODSRV-GAPT-CODC/onedata/bamboos'...
Cloning into '/mnt/storage/bamboo-agent-home/xml-data/build-dir/ODSRV-GAPT-CODC/onedata/cdmi_swagger'...
Cloning into '/mnt/storage/bamboo-agent-home/xml-data/build-dir/ODSRV-GAPT-CODC/onedata/one_env'...
Cloning into '/mnt/storage/bamboo-agent-home/xml-data/build-dir/ODSRV-GAPT-CODC/onedata/onepanel_swagger'...
Cloning into '/mnt/storage/bamboo-agent-home/xml-data/build-dir/ODSRV-GAPT-CODC/onedata/oneprovider_swagger'...
Cloning into '/mnt/storage/bamboo-agent-home/xml-data/build-dir/ODSRV-GAPT-CODC/onedata/onezone_swagger'...
Submodule 'bamboos' (ssh://git@git.onedata.org:7999/vfs/bamboos.git) registered for path 'onepanel_swagger/bamboos'
Cloning into '/mnt/storage/bamboo-agent-home/xml-data/build-dir/ODSRV-GAPT-CODC/onedata/onepanel_swagger/bamboos'...
Submodule 'bamboos' (ssh://git@git.onedata.org:7999/vfs/bamboos.git) registered for path 'oneprovider_swagger/bamboos'
Cloning into '/mnt/storage/bamboo-agent-home/xml-data/build-dir/ODSRV-GAPT-CODC/onedata/oneprovider_swagger/bamboos'...
Submodule 'bamboos' (ssh://git@git.onedata.org:7999/vfs/bamboos.git) registered for path 'onezone_swagger/bamboos'
Cloning into '/mnt/storage/bamboo-agent-home/xml-data/build-dir/ODSRV-GAPT-CODC/onedata/onezone_swagger/bamboos'...
error: failed to create clusterrolebinding: clusterrolebindings.rbac.authorization.k8s.io "serviceaccounts-cluster-admin" already exists
File "/usr/local/lib/python3.6/dist-packages/selenium/webdriver/remote/remote_connection.py", line 375 in execute
File "/usr/local/lib/python3.6/dist-packages/selenium/webdriver/remote/webdriver.py", line 318 in execute
File "/usr/local/lib/python3.6/dist-packages/selenium/webdriver/remote/webdriver.py", line 635 in execute_script
File "/mnt/storage/bamboo-agent-home/xml-data/build-dir/ODSRV-GAPT-CODC/onedata/tests/gui/utils/generic.py", line 136 in _scroll_to_css_sel
File "/mnt/storage/bamboo-agent-home/xml-data/build-dir/ODSRV-GAPT-CODC/onedata/tests/gui/utils/generic.py", line 92 in find_web_elem
File "/mnt/storage/bamboo-agent-home/xml-data/build-dir/ODSRV-GAPT-CODC/onedata/tests/gui/utils/core/web_elements.py", line 29 in __get__
File "/mnt/storage/bamboo-agent-home/xml-data/build-dir/ODSRV-GAPT-CODC/onedata/tests/gui/utils/core/web_elements.py", line 76 in __get__
File "/mnt/storage/bamboo-agent-home/xml-data/build-dir/ODSRV-GAPT-CODC/onedata/tests/gui/utils/common/common.py", line 52 in __str__
File "/mnt/storage/bamboo-agent-home/xml-data/build-dir/ODSRV-GAPT-CODC/onedata/tests/gui/utils/core/web_elements.py", line 34 in _format_msg
File "/mnt/storage/bamboo-agent-home/xml-data/build-dir/ODSRV-GAPT-CODC/onedata/tests/gui/utils/core/web_elements.py", line 30 in <lambda>
File "/mnt/storage/bamboo-agent-home/xml-data/build-dir/ODSRV-GAPT-CODC/onedata/tests/gui/utils/generic.py", line 96 in find_web_elem
File "/mnt/storage/bamboo-agent-home/xml-data/build-dir/ODSRV-GAPT-CODC/onedata/tests/gui/utils/core/web_elements.py", line 29 in __get__
File "/mnt/storage/bamboo-agent-home/xml-data/build-dir/ODSRV-GAPT-CODC/onedata/tests/gui/utils/core/web_elements.py", line 76 in __get__
File "/mnt/storage/bamboo-agent-home/xml-data/build-dir/ODSRV-GAPT-CODC/onedata/tests/gui/utils/common/common.py", line 52 in __str__
File "/mnt/storage/bamboo-agent-home/xml-data/build-dir/ODSRV-GAPT-CODC/onedata/tests/gui/utils/core/web_elements.py", line 34 in _format_msg
File "/mnt/storage/bamboo-agent-home/xml-data/build-dir/ODSRV-GAPT-CODC/onedata/tests/gui/utils/core/web_elements.py", line 30 in <lambda>
File "/mnt/storage/bamboo-agent-home/xml-data/build-dir/ODSRV-GAPT-CODC/onedata/tests/gui/utils/generic.py", line 96 in find_web_elem
File "/mnt/storage/bamboo-agent-home/xml-data/build-dir/ODSRV-GAPT-CODC/onedata/tests/gui/utils/core/web_elements.py", line 29 in __get__
File "/mnt/storage/bamboo-agent-home/xml-data/build-dir/ODSRV-GAPT-CODC/onedata/tests/gui/utils/core/web_elements.py", line 76 in __get__
File "/mnt/storage/bamboo-agent-home/xml-data/build-dir/ODSRV-GAPT-CODC/onedata/tests/gui/utils/common/common.py", line 52 in __str__
File "/mnt/storage/bamboo-agent-home/xml-data/build-dir/ODSRV-GAPT-CODC/onedata/tests/gui/utils/core/web_elements.py", line 34 in _format_msg
File "/mnt/storage/bamboo-agent-home/xml-data/build-dir/ODSRV-GAPT-CODC/onedata/tests/gui/utils/core/web_elements.py", line 30 in <lambda>
File "/mnt/storage/bamboo-agent-home/xml-data/build-dir/ODSRV-GAPT-CODC/onedata/tests/gui/utils/generic.py", line 96 in find_web_elem
File "/mnt/storage/bamboo-agent-home/xml-data/build-dir/ODSRV-GAPT-CODC/onedata/tests/gui/utils/core/web_elements.py", line 29 in __get__
File "/mnt/storage/bamboo-agent-home/xml-data/build-dir/ODSRV-GAPT-CODC/onedata/tests/gui/utils/core/web_elements.py", line 76 in __get__
File "/mnt/storage/bamboo-agent-home/xml-data/build-dir/ODSRV-GAPT-CODC/onedata/tests/gui/utils/common/common.py", line 52 in __str__
File "/mnt/storage/bamboo-agent-home/xml-data/build-dir/ODSRV-GAPT-CODC/onedata/tests/gui/utils/core/web_elements.py", line 34 in _format_msg
File "/mnt/storage/bamboo-agent-home/xml-data/build-dir/ODSRV-GAPT-CODC/onedata/tests/gui/utils/core/web_elements.py", line 30 in <lambda>
File "/mnt/storage/bamboo-agent-home/xml-data/build-dir/ODSRV-GAPT-CODC/onedata/tests/gui/utils/generic.py", line 96 in find_web_elem
File "/mnt/storage/bamboo-agent-home/xml-data/build-dir/ODSRV-GAPT-CODC/onedata/tests/gui/utils/core/web_elements.py", line 29 in __get__
File "/mnt/storage/bamboo-agent-home/xml-data/build-dir/ODSRV-GAPT-CODC/onedata/tests/gui/utils/core/web_elements.py", line 76 in __get__
File "/mnt/storage/bamboo-agent-home/xml-data/build-dir/ODSRV-GAPT-CODC/onedata/tests/gui/utils/common/common.py", line 52 in __str__
File "/mnt/storage/bamboo-agent-home/xml-data/build-dir/ODSRV-GAPT-CODC/onedata/tests/gui/utils/core/web_elements.py", line 34 in _format_msg
File "/mnt/storage/bamboo-agent-home/xml-data/build-dir/ODSRV-GAPT-CODC/onedata/tests/gui/utils/core/web_elements.py", line 30 in <lambda>
File "/mnt/storage/bamboo-agent-home/xml-data/build-dir/ODSRV-GAPT-CODC/onedata/tests/gui/utils/generic.py", line 96 in find_web_elem
File "/mnt/storage/bamboo-agent-home/xml-data/build-dir/ODSRV-GAPT-CODC/onedata/tests/gui/utils/core/web_elements.py", line 29 in __get__
File "/mnt/storage/bamboo-agent-home/xml-data/build-dir/ODSRV-GAPT-CODC/onedata/tests/gui/utils/core/web_elements.py", line 76 in __get__
File "/mnt/storage/bamboo-agent-home/xml-data/build-dir/ODSRV-GAPT-CODC/onedata/tests/gui/utils/common/common.py", line 52 in __str__
File "/mnt/storage/bamboo-agent-home/xml-data/build-dir/ODSRV-GAPT-CODC/onedata/tests/gui/utils/core/web_elements.py", line 34 in _format_msg
File "/mnt/storage/bamboo-agent-home/xml-data/build-dir/ODSRV-GAPT-CODC/onedata/tests/gui/utils/core/web_elements.py", line 30 in <lambda>
File "/mnt/storage/bamboo-agent-home/xml-data/build-dir/ODSRV-GAPT-CODC/onedata/tests/gui/utils/generic.py", line 96 in find_web_elem
File "/mnt/storage/bamboo-agent-home/xml-data/build-dir/ODSRV-GAPT-CODC/onedata/tests/gui/utils/core/web_elements.py", line 29 in __get__
File "/mnt/storage/bamboo-agent-home/xml-data/build-dir/ODSRV-GAPT-CODC/onedata/tests/gui/utils/core/web_elements.py", line 76 in __get__
File "/mnt/storage/bamboo-agent-home/xml-data/build-dir/ODSRV-GAPT-CODC/onedata/tests/gui/utils/common/common.py", line 52 in __str__
File "/mnt/storage/bamboo-agent-home/xml-data/build-dir/ODSRV-GAPT-CODC/onedata/tests/gui/utils/core/web_elements.py", line 34 in _format_msg
File "/mnt/storage/bamboo-agent-home/xml-data/build-dir/ODSRV-GAPT-CODC/onedata/tests/gui/utils/core/web_elements.py", line 30 in <lambda>
File "/mnt/storage/bamboo-agent-home/xml-data/build-dir/ODSRV-GAPT-CODC/onedata/tests/gui/utils/generic.py", line 96 in find_web_elem
File "/mnt/storage/bamboo-agent-home/xml-data/build-dir/ODSRV-GAPT-CODC/onedata/tests/gui/utils/core/web_elements.py", line 29 in __get__
File "/mnt/storage/bamboo-agent-home/xml-data/build-dir/ODSRV-GAPT-CODC/onedata/tests/gui/utils/core/web_elements.py", line 76 in __get__
File "/mnt/storage/bamboo-agent-home/xml-data/build-dir/ODSRV-GAPT-CODC/onedata/tests/gui/utils/common/common.py", line 52 in __str__
File "/mnt/storage/bamboo-agent-home/xml-data/build-dir/ODSRV-GAPT-CODC/onedata/tests/gui/utils/core/web_elements.py", line 34 in _format_msg
File "/mnt/storage/bamboo-agent-home/xml-data/build-dir/ODSRV-GAPT-CODC/onedata/tests/gui/utils/core/web_elements.py", line 30 in <lambda>
File "/mnt/storage/bamboo-agent-home/xml-data/build-dir/ODSRV-GAPT-CODC/onedata/tests/gui/utils/generic.py", line 96 in find_web_elem
File "/mnt/storage/bamboo-agent-home/xml-data/build-dir/ODSRV-GAPT-CODC/onedata/tests/gui/utils/core/web_elements.py", line 29 in __get__
File "/mnt/storage/bamboo-agent-home/xml-data/build-dir/ODSRV-GAPT-CODC/onedata/tests/gui/utils/core/web_elements.py", line 76 in __get__
File "/mnt/storage/bamboo-agent-home/xml-data/build-dir/ODSRV-GAPT-CODC/onedata/tests/gui/utils/common/common.py", line 52 in __str__
File "/mnt/storage/bamboo-agent-home/xml-data/build-dir/ODSRV-GAPT-CODC/onedata/tests/gui/utils/core/web_elements.py", line 34 in _format_msg
File "/mnt/storage/bamboo-agent-home/xml-data/build-dir/ODSRV-GAPT-CODC/onedata/tests/gui/utils/core/web_elements.py", line 30 in <lambda>
File "/mnt/storage/bamboo-agent-home/xml-data/build-dir/ODSRV-GAPT-CODC/onedata/tests/gui/utils/generic.py", line 96 in find_web_elem
File "/mnt/storage/bamboo-agent-home/xml-data/build-dir/ODSRV-GAPT-CODC/onedata/tests/gui/utils/core/web_elements.py", line 29 in __get__
File "/mnt/storage/bamboo-agent-home/xml-data/build-dir/ODSRV-GAPT-CODC/onedata/tests/gui/utils/core/web_elements.py", line 76 in __get__
File "/mnt/storage/bamboo-agent-home/xml-data/build-dir/ODSRV-GAPT-CODC/onedata/tests/gui/utils/common/common.py", line 52 in __str__
File "/mnt/storage/bamboo-agent-home/xml-data/build-dir/ODSRV-GAPT-CODC/onedata/tests/gui/utils/core/web_elements.py", line 34 in _format_msg
File "/mnt/storage/bamboo-agent-home/xml-data/build-dir/ODSRV-GAPT-CODC/onedata/tests/gui/utils/core/web_elements.py", line 30 in <lambda>
File "/mnt/storage/bamboo-agent-home/xml-data/build-dir/ODSRV-GAPT-CODC/onedata/tests/gui/utils/generic.py", line 96 in find_web_elem
File "/mnt/storage/bamboo-agent-home/xml-data/build-dir/ODSRV-GAPT-CODC/onedata/tests/gui/utils/core/web_elements.py", line 29 in __get__
File "/mnt/storage/bamboo-agent-home/xml-data/build-dir/ODSRV-GAPT-CODC/onedata/tests/gui/utils/core/web_elements.py", line 76 in __get__
File "/mnt/storage/bamboo-agent-home/xml-data/build-dir/ODSRV-GAPT-CODC/onedata/tests/gui/utils/common/common.py", line 52 in __str__
File "/mnt/storage/bamboo-agent-home/xml-data/build-dir/ODSRV-GAPT-CODC/onedata/tests/gui/utils/core/web_elements.py", line 34 in _format_msg
File "/mnt/storage/bamboo-agent-home/xml-data/build-dir/ODSRV-GAPT-CODC/onedata/tests/gui/utils/core/web_elements.py", line 30 in <lambda>
File "/mnt/storage/bamboo-agent-home/xml-data/build-dir/ODSRV-GAPT-CODC/onedata/tests/gui/utils/generic.py", line 96 in find_web_elem
File "/mnt/storage/bamboo-agent-home/xml-data/build-dir/ODSRV-GAPT-CODC/onedata/tests/gui/utils/core/web_elements.py", line 29 in __get__
File "/mnt/storage/bamboo-agent-home/xml-data/build-dir/ODSRV-GAPT-CODC/onedata/tests/gui/utils/core/web_elements.py", line 76 in __get__
File "/mnt/storage/bamboo-agent-home/xml-data/build-dir/ODSRV-GAPT-CODC/onedata/tests/gui/utils/common/common.py", line 52 in __str__
File "/mnt/storage/bamboo-agent-home/xml-data/build-dir/ODSRV-GAPT-CODC/onedata/tests/gui/utils/core/web_elements.py", line 34 in _format_msg
File "/mnt/storage/bamboo-agent-home/xml-data/build-dir/ODSRV-GAPT-CODC/onedata/tests/gui/utils/core/web_elements.py", line 30 in <lambda>
File "/mnt/storage/bamboo-agent-home/xml-data/build-dir/ODSRV-GAPT-CODC/onedata/tests/gui/utils/generic.py", line 96 in find_web_elem
File "/mnt/storage/bamboo-agent-home/xml-data/build-dir/ODSRV-GAPT-CODC/onedata/tests/gui/utils/core/web_elements.py", line 29 in __get__
File "/mnt/storage/bamboo-agent-home/xml-data/build-dir/ODSRV-GAPT-CODC/onedata/tests/gui/utils/core/web_elements.py", line 76 in __get__
File "/mnt/storage/bamboo-agent-home/xml-data/build-dir/ODSRV-GAPT-CODC/onedata/tests/gui/utils/common/common.py", line 52 in __str__
File "/mnt/storage/bamboo-agent-home/xml-data/build-dir/ODSRV-GAPT-CODC/onedata/tests/gui/utils/core/web_elements.py", line 34 in _format_msg
File "/mnt/storage/bamboo-agent-home/xml-data/build-dir/ODSRV-GAPT-CODC/onedata/tests/gui/utils/core/web_elements.py", line 30 in <lambda>
File "/mnt/storage/bamboo-agent-home/xml-data/build-dir/ODSRV-GAPT-CODC/onedata/tests/gui/utils/generic.py", line 96 in find_web_elem
File "/mnt/storage/bamboo-agent-home/xml-data/build-dir/ODSRV-GAPT-CODC/onedata/tests/gui/utils/core/web_elements.py", line 29 in __get__
File "/mnt/storage/bamboo-agent-home/xml-data/build-dir/ODSRV-GAPT-CODC/onedata/tests/gui/utils/core/web_elements.py", line 76 in __get__
File "/mnt/storage/bamboo-agent-home/xml-data/build-dir/ODSRV-GAPT-CODC/onedata/tests/gui/utils/common/common.py", line 52 in __str__
File "/mnt/storage/bamboo-agent-home/xml-data/build-dir/ODSRV-GAPT-CODC/onedata/tests/gui/utils/core/web_elements.py", line 34 in _format_msg
File "/mnt/storage/bamboo-agent-home/xml-data/build-dir/ODSRV-GAPT-CODC/onedata/tests/gui/utils/core/web_elements.py", line 30 in <lambda>
File "/mnt/storage/bamboo-agent-home/xml-data/build-dir/ODSRV-GAPT-CODC/onedata/tests/gui/utils/generic.py", line 96 in find_web_elem
File "/mnt/storage/bamboo-agent-home/xml-data/build-dir/ODSRV-GAPT-CODC/onedata/tests/gui/utils/core/web_elements.py", line 29 in __get__
...
Traceback (most recent call last):
File "./test_run.py", line 351, in <module>
main()
File "./test_run.py", line 344, in main
if env_errors_exists(report):
File "./test_run.py", line 61, in env_errors_exists
testcases = testsuite.findall('testcase')
AttributeError: 'NoneType' object has no attribute 'findall'
make: *** [Makefile:89: test_gui_pkg] Error 1
cp: cannot stat 'onedata/test-reports/*.xml': No such file or directory
cp: cannot stat 'onedata/one_env/sources_info.yaml': No such file or directory
% Total % Received % Xferd Average Speed Time Time Time Current
Dload Upload Total Spent Left Speed
0 0 0 0 0 0 0 0 --:--:-- --:--:-- --:--:-- 0
100 4653 100 4653 0 0 47969 0 --:--:-- --:--:-- --:--:-- 47969
Error response from daemon: Cannot kill container: 71ce6430bc0d: Container 71ce6430bc0d34ea2892af672f9bd00862f47d0731841876ff4b9de857b7bd40 is not running
Error response from daemon: Cannot kill container: 7dafbb109b7b: Container 7dafbb109b7b12c683aec09174d3622584df6544ce8054ff589fadb433d0a68c is not running
Error response from daemon: Cannot kill container: d7c5e2b0208d: Container d7c5e2b0208d12513b04325a2520cf5725cefeeb9bac3554449ab32011078d47 is not running
Error response from daemon: Cannot kill container: d46cc51b14fa: Container d46cc51b14fa93eb1c0aa6980a1f5ed230994e6c4663ac9f1863fad3cb380317 is not running
Error response from daemon: Cannot kill container: f951c18f3346: Container f951c18f33469677cd0815223c844e30608383c39a660df4a69a4aa89d6ecc86 is not running
Error response from daemon: Cannot kill container: 14747a0dd5cd: Container 14747a0dd5cdfa8237b5e069b2f45a3727a7757153522c2680f9b8e1156052e4 is not running
Error response from daemon: Cannot kill container: cb3537395bc6: Container cb3537395bc60535f5b1887f62a8c79de8b83f9c0ac4a08e9f4b2535487d6ca6 is not running
Error response from daemon: Cannot kill container: f587911af352: Container f587911af35265382f86f76fb5909c86b60a26d6f918f021e79b4485e5d550d4 is not running
Error response from daemon: Cannot kill container: ac8cef2977ea: Container ac8cef2977ead86dd642ecae6daaa49429e1db79bdf3252e4220d5896ff9e4d1 is not running