GUI acceptance tests using environment deployed from packages.

Build: #590 failed

Job: Onezone harvesters basic failed

Job result summary

Completed
Duration
2 minutes
Revision
9b6aeab526a1868b93ef6702423c65d1a7c811df
Failing since
#589 (Child of ODSRV-OZP-1218)
Fixed in
#592 (Changes by Łukasz Opioła)
No failed test found. A possible compilation error occurred.

Error summary

The build generated some errors. See the full build log for more details.

  % Total    % Received % Xferd  Average Speed   Time    Time     Time  Current
                                 Dload  Upload   Total   Spent    Left  Speed

  0     0    0     0    0     0      0      0 --:--:-- --:--:-- --:--:--     0
100  3376  100  3376    0     0  11909      0 --:--:-- --:--:-- --:--:-- 11929
Error response from daemon: Cannot kill container c693bd2a75d6: Container c693bd2a75d64a2370d0ae3a70d346574546f382b627061c14ca0713a8dfa84a is not running
No resources found.
tput: unknown terminal "unknown"
tput: unknown terminal "unknown"
Cloning into 'bamboos'...
Cloning into 'cdmi_swagger'...
Cloning into 'one_env'...
Cloning into 'onepanel_swagger'...
Cloning into 'oneprovider_swagger'...
Cloning into 'onezone_swagger'...
Unable to use a TTY - container test-runner did not allocate one
If you don't see a command prompt, try pressing enter.
usage: test.py [options] [file_or_dir] [file_or_dir] [...]
test.py: error: unrecognized arguments: --xvfb --xvfb-recording=failed
  inifile: None
  rootdir: /mnt/storage/bamboo-agent-home/xml-data/build-dir/ODSRV-GAPT-COHBT/onedata
pod default/test-runner terminated (Error)
Traceback (most recent call last):
  File "./test_run.py", line 495, in <module>
    if ret != 0 and not skipped_test_exists(report):
  File "./test_run.py", line 88, in skipped_test_exists
    if testsuite.attrib['skips'] != '0':
AttributeError: 'NoneType' object has no attribute 'attrib'
make: *** [test_gui_pkg] Error 1
cp: cannot stat 'onedata/test-reports/*.xml': No such file or directory
mv: failed to access 'onedata/tests/gui/logs/gui_report': Not a directory
mv: cannot stat 'onedata/tests/gui/logs/gui_report/images.yaml': Not a directory
  % Total    % Received % Xferd  Average Speed   Time    Time     Time  Current
                                 Dload  Upload   Total   Spent    Left  Speed

  0     0    0     0    0     0      0      0 --:--:-- --:--:-- --:--:--     0
  0     0    0     0    0     0      0      0 --:--:-- --:--:-- --:--:--     0
100  3376  100  3376    0     0   6892      0 --:--:-- --:--:-- --:--:--  6889
Error response from daemon: Cannot kill container 00ef324fdf37: Container 00ef324fdf37694926dadbdae48bfa6fd5b57b8f780d0e7552e64bf8e2595036 is not running
Error response from daemon: Cannot kill container aa5171d01974: Container aa5171d01974e9735fe262e9fc91422f4611f293fd30884f483bde20b6870e11 is not running
Error response from daemon: Cannot kill container e046699d7f72: Container e046699d7f729b243dd4739cde33f43fc4c0652a884bc07e36cebd66d9b1396a is not running