GUI acceptance tests using environment deployed from packages.

Build: #1719 failed

Job: Storage sync failed

Test results

  • 8 tests in total
  • 7 tests failed
  • 7 failures are new
  • 57 minutes taken in total.

Build 1,719 has the following 7 errors: 7 new failure(s) occurred since the previous build.

New test failures 7
Status Test Duration
Collapse Failed test_storage_sync test_user_does_not_see_files_and_directories_that_have_been_removed_in_storage_mount_point_when_detect_deletions_option_was_enabled[1oz_1op_deployed]
6 mins
AssertionError: not found "dir21" in browser
request = <FixtureRequest for <Function 'test_user_does_not_see_files_and_directories_that_have_been_removed_in_storage_mount_point_when_detect_deletions_option_was_enabled[1oz_1op_deployed]'>>

    @pytest.mark.usefixtures(*function_args)
    def scenario_wrapper(request):
>       _execute_scenario(feature, scenario, request, encoding)

/usr/local/lib/python3.6/dist-packages/pytest_bdd/scenario.py:227: 
(50 more lines...)
Collapse Failed test_storage_sync test_user_does_not_see_files_update_when_detect_modifications_is_disabled[1oz_1op_deployed]
6 mins
AssertionError: not found "dir21" in browser
subtree = ['dir21', 'dir22', {'file1.txt': 22222}], user = 'browser2'
tmp_memory = defaultdict(<class 'dict'>, {'browser1': {'shares': {}, 'spaces': {}, 'groups': {}, 'mailbox': {'token': 'MDAzM2xvY2F0...': {'modal': None}, 'file_browser': <tests.gui.utils.oneprovider.file_browser._FileBrowser object at 0x7fdecd371358>}})
cwd = '/dir2'
selenium = {'browser1': <selenium.webdriver.chrome.webdriver.WebDriver (session="2d2b0440d36b1bd1b65d661e99ee5af8")>, 'browser2': <selenium.webdriver.chrome.webdriver.WebDriver (session="d71e0e589c38024ac8a62b7f1c3c6416")>}
op_container = <class 'tests.gui.utils.oneprovider.OPLoggedIn'>
tmpdir = local('/tmp/pytest-of-bamboo/pytest-0/test_user_does_not_see_files_u1')
which_browser = 'file browser'
(69 more lines...)
Collapse Failed test_storage_sync test_user_sees_files_update_when_detect_modifications_is_set[1oz_1op_deployed]
7 mins
AssertionError: not found "dir21" in browser
subtree = ['dir21', 'dir22', {'file1.txt': 22222}], user = 'browser2'
tmp_memory = defaultdict(<class 'dict'>, {'browser1': {'shares': {}, 'spaces': {}, 'groups': {}, 'mailbox': {'token': 'MDAzM2xvY2F0...': {'modal': None}, 'file_browser': <tests.gui.utils.oneprovider.file_browser._FileBrowser object at 0x7fdecd282f60>}})
cwd = '/dir2'
selenium = {'browser1': <selenium.webdriver.chrome.webdriver.WebDriver (session="8f4844934922e4fee32fadf20516cb5c")>, 'browser2': <selenium.webdriver.chrome.webdriver.WebDriver (session="90fb1744197dd857d0073e6940d65487")>}
op_container = <class 'tests.gui.utils.oneprovider.OPLoggedIn'>
tmpdir = local('/tmp/pytest-of-bamboo/pytest-0/test_user_sees_files_update_wh1')
which_browser = 'file browser'
(69 more lines...)
Collapse Failed test_storage_sync test_user_sees_imported_files_after_supporting_space_and_sees_difference_when_max_depth_has_changed[1oz_1op_deployed]
6 mins
AssertionError: file browser in files tab in op should be empty but is not
subtree = ['dir21', 'dir22', {'file1.txt': 22222}], user = 'browser2'
tmp_memory = defaultdict(<class 'dict'>, {'browser1': {'shares': {}, 'spaces': {}, 'groups': {}, 'mailbox': {'token': 'MDAzM2xvY2F0...': {'modal': None}, 'file_browser': <tests.gui.utils.oneprovider.file_browser._FileBrowser object at 0x7fdecd371128>}})
cwd = '/dir2'
selenium = {'browser1': <selenium.webdriver.chrome.webdriver.WebDriver (session="b72747c20d669670ee166c2ec5304490")>, 'browser2': <selenium.webdriver.chrome.webdriver.WebDriver (session="c68f73aa1d0476a44ef139423921bd94")>}
op_container = <class 'tests.gui.utils.oneprovider.OPLoggedIn'>
tmpdir = local('/tmp/pytest-of-bamboo/pytest-0/test_user_sees_imported_files_1')
which_browser = 'file browser'
(61 more lines...)
Collapse Failed test_storage_sync test_user_sees_that_directory_is_not_synchronized_automatically_when_continuous_scan_is_disabled[1oz_1op_deployed]
6 mins
AssertionError: not found "dir21" in browser
request = <FixtureRequest for <Function 'test_user_sees_that_directory_is_not_synchronized_automatically_when_continuous_scan_is_disabled[1oz_1op_deployed]'>>

    @pytest.mark.usefixtures(*function_args)
    def scenario_wrapper(request):
>       _execute_scenario(feature, scenario, request, encoding)

/usr/local/lib/python3.6/dist-packages/pytest_bdd/scenario.py:227: 
(50 more lines...)
Collapse Failed test_storage_sync test_user_sees_that_files_are_deleted_after_synchronization_when_detect_deletions_is_enabled_and_detect_modifications_is_disabled[1oz_1op_deployed]
7 mins
AssertionError: not found "dir211" in browser
subtree = ['dir211', {'file2.txt': 11111}], user = 'browser2'
tmp_memory = defaultdict(<class 'dict'>, {'browser1': {'shares': {}, 'spaces': {}, 'groups': {}, 'mailbox': {'token': 'MDAzM2xvY2F0...': {'modal': None}, 'file_browser': <tests.gui.utils.oneprovider.file_browser._FileBrowser object at 0x7fdecd1b0668>}})
cwd = '/dir2/dir21'
selenium = {'browser1': <selenium.webdriver.chrome.webdriver.WebDriver (session="f9c7f788392db9f63dc03716c84dddc7")>, 'browser2': <selenium.webdriver.chrome.webdriver.WebDriver (session="55b19c9af8652dd746a5f1b90b030fa0")>}
op_container = <class 'tests.gui.utils.oneprovider.OPLoggedIn'>
tmpdir = local('/tmp/pytest-of-bamboo/pytest-0/test_user_sees_that_files_are_1')
which_browser = 'file browser'
(71 more lines...)
Collapse Failed test_storage_sync test_user_synchronizes_directory_manually_when_continuous_scan_is_disabled[1oz_1op_deployed]
7 mins
AssertionError: not found "dir211" in browser
subtree = ['dir211', 'file2.txt'], user = 'browser2'
tmp_memory = defaultdict(<class 'dict'>, {'browser1': {'shares': {}, 'spaces': {}, 'groups': {}, 'mailbox': {'token': 'MDAzM2xvY2F0...': {'modal': None}, 'file_browser': <tests.gui.utils.oneprovider.file_browser._FileBrowser object at 0x7fdecd1b0e80>}})
cwd = '/dir2/dir21'
selenium = {'browser1': <selenium.webdriver.chrome.webdriver.WebDriver (session="146e7794eb809d3f7f65d85768f0719f")>, 'browser2': <selenium.webdriver.chrome.webdriver.WebDriver (session="61ee1126a52a8932ba34da209fe97e63")>}
op_container = <class 'tests.gui.utils.oneprovider.OPLoggedIn'>
tmpdir = local('/tmp/pytest-of-bamboo/pytest-0/test_user_synchronizes_directo1')
which_browser = 'file browser'
(71 more lines...)