Acceptance tests using different clients concurrently. Environment deployed from packages.
Build: #1786 failed Child of ODSRV-OPRPM-1966
Test results
- 412 tests in total
- 3 tests failed
- 3 failures are new
- 2 tests were fixed
- 27 tests were quarantined / skipped
- 509 minutes taken in total.
Status | Test | View job | Duration | |
---|---|---|---|---|
Collapse |
test_onepanel_basic
test_files_tree_with_specified_depth_is_imported_to_space_after_changing_import_depth_and_disable_modification_detection_option[1oz_1op_1oc-web GUI-REST]
|
Chrome onepanel tests | 7 mins | |
AssertionError: not found "dir2" in browser request = <FixtureRequest for <Function 'test_files_tree_with_specified_depth_is_imported_to_space_after_changing_import_depth_and_disable_modification_detection_option[1oz_1op_1oc-web GUI-REST]'>> @pytest.mark.usefixtures(*function_args) def scenario_wrapper(request): > _execute_scenario(feature, scenario, request, encoding) /usr/local/lib/python3.6/dist-packages/pytest_bdd/scenario.py:227: (54 more lines...) |
||||
Collapse |
test_onepanel_basic
test_user_does_not_see_files_tree_changes_after_disabling_continuous_scan_option[1oz_1op_1oc-web GUI-REST]
|
Chrome onepanel tests | 7 mins | |
AssertionError: not found "dir21" in browser subtree = ['dir21', 'dir22', {'file1.txt': 22222}], user = 'user1' tmp_memory = defaultdict(<class 'dict'>, {'onepanel': {'shares': {}, 'spaces': {}, 'groups': {}, 'mailbox': {'token': 'MDAzM2xvY2F0...Mjk00OTUxNzIKMDAyZnNpZ25hdHVyZSDasOBuGCMBOIUzlmdjoUV02cZkElcTwGtmzvVWqEeS5QQo'}, 'oz': {}, 'window': {'modal': None}}}) cwd = '/dir2' selenium = {'browsers': <selenium.webdriver.chrome.webdriver.WebDriver (session="bdcd205c41d57cddfd7062a374a8fa02")>, 'onepanel':...62a374a8fa02")>, 'user1': <selenium.webdriver.chrome.webdriver.WebDriver (session="b0d416cb5b9170884d352d001921b010")>} op_container = <class 'tests.gui.utils.oneprovider.OPLoggedIn'> tmpdir = local('/tmp/pytest-of-bamboo/pytest-0/test_user_does_not_see_files_t1') which_browser = 'file browser' (75 more lines...) |
||||
Collapse |
test_onepanel_basic
test_files_tree_with_specified_depth_is_imported_to_space_after_changing_max_depth_enabling_delete_and_disabling_modification_detection[1oz_1op_1oc-web GUI-REST]
|
Chrome onepanel tests | 9 mins | |
AssertionError: not found "dir2" in browser request = <FixtureRequest for <Function 'test_files_tree_with_specified_depth_is_imported_to_space_after_changing_max_depth_enabling_delete_and_disabling_modification_detection[1oz_1op_1oc-web GUI-REST]'>> @pytest.mark.usefixtures(*function_args) def scenario_wrapper(request): > _execute_scenario(feature, scenario, request, encoding) /usr/local/lib/python3.6/dist-packages/pytest_bdd/scenario.py:227: (54 more lines...) |
Status | Test | Failing since | View job | Duration |
---|---|---|---|---|
test_file_content
test_user_appends_text_to_file_using_client2_and_using_client1_sees_that_files_content_has_changed[1oz_1op_1oc-REST-oneclient1-REST]
|
Failing since build #1785 (Child of ODSRV-OPV-1298) | Chrome file content tests | 13 secs | |
test_onepanel_basic
test_files_tree_with_specified_depth_is_imported_to_space_after_changing_import_depth_and_enable_delete_detection_option[1oz_1op_1oc-web GUI-REST]
|
Failing since build #1785 (Child of ODSRV-OPV-1298) | Chrome onepanel tests | 5 mins |
Status | Test | Failing since | Quarantined by | View job | Duration | |
---|---|---|---|---|---|---|
test_file_content
test_user_writes_to_file_using_client2_and_using_client1_sees_that_files_content_has_changed[1oz_1op_1oc-REST-oneclient1-REST]
|
Not quarantined | Chrome file content tests | 1 min |