Acceptance tests using different clients concurrently. Environment deployed from packages.

Build: #28 failed

Job: Files times failed

Job result summary

Completed
Duration
19 minutes
Revision
488588ad291bca143481c8bb3300dcf6d9b37a5c
Total tests
6
Fixed in
#29 (Child of ODSRV-OZP208-10)
No failed test found. A possible compilation error occurred.

Tests

  • 6 tests in total
  • 6 tests were quarantined / skipped
  • 12 minutes taken in total.

Error summary

The build generated some errors. See the full build log for more details.

  % Total    % Received % Xferd  Average Speed   Time    Time     Time  Current
                                 Dload  Upload   Total   Spent    Left  Speed

  0     0    0     0    0     0      0      0 --:--:-- --:--:-- --:--:--     0
100  4658  100  4658    0     0  17927      0 --:--:-- --:--:-- --:--:-- 17984
Error response from daemon: Cannot kill container: dcfe7bf3825a: Container dcfe7bf3825a39295d07c5ae3851958112662a713fcfd099e67f1f838aa5019a is not running
tput: unknown terminal "unknown"
Cloning into 'bamboos'...
Cloning into 'cdmi_swagger'...
Cloning into 'one_env'...
Cloning into 'onepanel_swagger'...
Cloning into 'bamboos'...
Cloning into 'oneprovider_swagger'...
Cloning into 'bamboos'...
Cloning into 'onezone_swagger'...
Cloning into 'bamboos'...
Error from server (AlreadyExists): clusterrolebindings.rbac.authorization.k8s.io "serviceaccounts-cluster-admin" already exists
41631a91550b: Verifying Checksum
41631a91550b: Download complete
0052a0bfc7d4: Verifying Checksum
0052a0bfc7d4: Download complete
29e8ef0e3340: Pull complete
a0c934d2565d: Pull complete
a360a17c9cab: Pull complete
cfcc996af805: Pull complete
929c0f2dd547: Verifying Checksum
929c0f2dd547: Download complete
2cf014724202: Pull complete
4bc402a00dfe: Pull complete
42e8617f0e99: Pull complete
65fd0f54cd10: Pull complete
d00d787b8b47: Pull complete
4f7819d2469d: Pull complete
6101f59c0192: Pull complete
c51589b64288: Pull complete
adc581da074d: Pull complete
1edf98ea4248: Pull complete
0052a0bfc7d4: Pull complete
c99deac4c9c8: Pull complete
929c0f2dd547: Pull complete
fab33748240d: Pull complete
41631a91550b: Pull complete
Digest: sha256:0de956a5df13693367da0d8c0d47c03bf32f8659c203a0ce057d9a5e5a680d27
Status: Downloaded newer image for docker.onedata.org/swagger-codegen:2.2.2-1b1767e
Unable to find image 'docker.onedata.org/swagger-codegen-official:ID-507bde287c' locally
ID-507bde287c: Pulling from swagger-codegen-official
21ccaf2415f2: Pulling fs layer
94055710d4b3: Pulling fs layer
2759cb70c9a7: Pulling fs layer
c66ae20f6a02: Pulling fs layer
fdd9c60aff1e: Pulling fs layer
6a4379a75cf2: Pulling fs layer
0689acf3295b: Pulling fs layer
600d774fa9ba: Pulling fs layer
c0124207460e: Pulling fs layer
c9d190bc8802: Pulling fs layer
18ae334f036f: Pulling fs layer
84453ebd093f: Pulling fs layer
ae292bd467c0: Pulling fs layer
18f93dab9c17: Pulling fs layer
699d7a2562b1: Pulling fs layer
c0124207460e: Waiting
c9d190bc8802: Waiting
18ae334f036f: Waiting
c66ae20f6a02: Waiting
fdd9c60aff1e: Waiting
6a4379a75cf2: Waiting
0689acf3295b: Waiting
600d774fa9ba: Waiting
84453ebd093f: Waiting
ae292bd467c0: Waiting
18f93dab9c17: Waiting
699d7a2562b1: Waiting
94055710d4b3: Download complete
c66ae20f6a02: Download complete
fdd9c60aff1e: Verifying Checksum
fdd9c60aff1e: Download complete
21ccaf2415f2: Verifying Checksum
21ccaf2415f2: Download complete
6a4379a75cf2: Verifying Checksum
6a4379a75cf2: Download complete
2759cb70c9a7: Verifying Checksum
2759cb70c9a7: Download complete
c0124207460e: Verifying Checksum
c0124207460e: Download complete
600d774fa9ba: Verifying Checksum
600d774fa9ba: Download complete
18ae334f036f: Verifying Checksum
18ae334f036f: Download complete
0689acf3295b: Verifying Checksum
0689acf3295b: Download complete
c9d190bc8802: Verifying Checksum
c9d190bc8802: Download complete
21ccaf2415f2: Pull complete
18f93dab9c17: Download complete
84453ebd093f: Verifying Checksum
84453ebd093f: Download complete
699d7a2562b1: Download complete
94055710d4b3: Pull complete
ae292bd467c0: Verifying Checksum
ae292bd467c0: Download complete
2759cb70c9a7: Pull complete
c66ae20f6a02: Pull complete
fdd9c60aff1e: Pull complete
6a4379a75cf2: Pull complete
0689acf3295b: Pull complete
600d774fa9ba: Pull complete
c0124207460e: Pull complete
c9d190bc8802: Pull complete
18ae334f036f: Pull complete
84453ebd093f: Pull complete
ae292bd467c0: Pull complete
18f93dab9c17: Pull complete
699d7a2562b1: Pull complete
Digest: sha256:2070162f6ce8028e3a01294e345a00d1910f3a35f8ad59d63f86ccbbae5c94f6
Status: Downloaded newer image for docker.onedata.org/swagger-codegen-official:ID-507bde287c
/bin/sh: 2: [[: not found
72e343687f59: Pulling fs layer
9eab0dcb7472: Pulling fs layer
5e03968ab62c: Pulling fs layer
effa2f44f9f9: Pulling fs layer
f8ea05222a70: Pulling fs layer
aa843a5f0dee: Pulling fs layer
052ff3ac3803: Pulling fs layer
7bd9b3577e7d: Pulling fs layer
408a2dad6bda: Pulling fs layer
5beaefb3b416: Pulling fs layer
effa2f44f9f9: Waiting
f8ea05222a70: Waiting
aa843a5f0dee: Waiting
052ff3ac3803: Waiting
7bd9b3577e7d: Waiting
408a2dad6bda: Waiting
5beaefb3b416: Waiting
5865ffcab7b0: Waiting
72e343687f59: Waiting
9eab0dcb7472: Waiting
5e03968ab62c: Waiting
ee671aafb583: Verifying Checksum
ee671aafb583: Download complete
d83811f270d5: Verifying Checksum
d83811f270d5: Download complete
7fc152dfb3a6: Verifying Checksum
7fc152dfb3a6: Download complete
72e343687f59: Verifying Checksum
72e343687f59: Download complete
5667fdb72017: Verifying Checksum
5667fdb72017: Download complete
5e03968ab62c: Verifying Checksum
5e03968ab62c: Download complete
9eab0dcb7472: Verifying Checksum
9eab0dcb7472: Download complete
f8ea05222a70: Verifying Checksum
f8ea05222a70: Download complete
5667fdb72017: Pull complete
aa843a5f0dee: Verifying Checksum
aa843a5f0dee: Download complete
d83811f270d5: Pull complete
5865ffcab7b0: Verifying Checksum
5865ffcab7b0: Download complete
052ff3ac3803: Verifying Checksum
052ff3ac3803: Download complete
7bd9b3577e7d: Verifying Checksum
7bd9b3577e7d: Download complete
408a2dad6bda: Verifying Checksum
408a2dad6bda: Download complete
5beaefb3b416: Verifying Checksum
5beaefb3b416: Download complete
ee671aafb583: Pull complete
7fc152dfb3a6: Pull complete
effa2f44f9f9: Verifying Checksum
effa2f44f9f9: Download complete
5865ffcab7b0: Pull complete
72e343687f59: Pull complete
9eab0dcb7472: Pull complete
5e03968ab62c: Pull complete
effa2f44f9f9: Pull complete
f8ea05222a70: Pull complete
aa843a5f0dee: Pull complete
052ff3ac3803: Pull complete
7bd9b3577e7d: Pull complete
408a2dad6bda: Pull complete
5beaefb3b416: Pull complete
Digest: sha256:50d0e0f234846c88dcda7cbf75d56bc46e39bbd229023d2e54091ddea12e5779
Status: Downloaded newer image for docker.onedata.org/one_env:16
Error from server (AlreadyExists): clusterrolebindings.rbac.authorization.k8s.io "serviceaccounts-cluster-admin" already exists
Error from server (AlreadyExists): clusterrolebindings.rbac.authorization.k8s.io "serviceaccounts-cluster-admin" already exists
Traceback (most recent call last):
  File "/usr/local/bin/onenv", line 104, in <module>
    main()
  File "/usr/local/bin/onenv", line 98, in main
    module.main()
  File "/usr/local/lib/one_env_engine/scripts/onenv_hosts.py", line 85, in main
    update_etc_hosts()
  File "/usr/local/lib/one_env_engine/scripts/onenv_hosts.py", line 50, in update_etc_hosts
    onenv_ip_map = get_onenv_ip_map()
  File "/usr/local/lib/one_env_engine/scripts/onenv_hosts.py", line 35, in get_onenv_ip_map
    for pod in status['pods'].values():
AttributeError: 'NoneType' object has no attribute 'values'
Error from server (AlreadyExists): clusterrolebindings.rbac.authorization.k8s.io "serviceaccounts-cluster-admin" already exists
Traceback (most recent call last):
  File "/usr/local/bin/onenv", line 104, in <module>
    main()
  File "/usr/local/bin/onenv", line 98, in main
    module.main()
  File "/usr/local/lib/one_env_engine/scripts/onenv_hosts.py", line 85, in main
    update_etc_hosts()
  File "/usr/local/lib/one_env_engine/scripts/onenv_hosts.py", line 50, in update_etc_hosts
    onenv_ip_map = get_onenv_ip_map()
  File "/usr/local/lib/one_env_engine/scripts/onenv_hosts.py", line 35, in get_onenv_ip_map
    for pod in status['pods'].values():
AttributeError: 'NoneType' object has no attribute 'values'
Error from server (AlreadyExists): clusterrolebindings.rbac.authorization.k8s.io "serviceaccounts-cluster-admin" already exists
rsync: change_dir#3 "/tmp/oc_logs" failed: No such file or directory (2)
rsync error: errors selecting input/output files, dirs (code 3) at main.c(819) [sender=3.1.2]
command terminated with exit code 3
make: *** [test_mixed_pkg] Error 1
cp: cannot stat 'onedata/one_env/sources_info.yaml': No such file or directory
  % Total    % Received % Xferd  Average Speed   Time    Time     Time  Current
                                 Dload  Upload   Total   Spent    Left  Speed

  0     0    0     0    0     0      0      0 --:--:-- --:--:-- --:--:--     0
  0     0    0     0    0     0      0      0 --:--:-- --:--:-- --:--:--     0
100  4658  100  4658    0     0  18252      0 --:--:-- --:--:-- --:--:-- 18195
Error response from daemon: Cannot kill container: 21aa861ad5a3: Container 21aa861ad5a3ca845d0f4d2a963d84192b14a4621792b9b3ae009f068ae743a4 is not running
Error response from daemon: Cannot kill container: eec0fcb1e75e: No such container: eec0fcb1e75e
Error: No such container: eec0fcb1e75e
Error response from daemon: Cannot kill container: 29747ef149c9: No such container: 29747ef149c9
Error: No such container: 29747ef149c9
Error response from daemon: Cannot kill container: 26f6290a7d33: No such container: 26f6290a7d33
Error: No such container: 26f6290a7d33
Error response from daemon: Cannot kill container: 6fb151ea307c: No such container: 6fb151ea307c
Error: No such container: 6fb151ea307c
Error response from daemon: Cannot kill container: 18061ea9d790: No such container: 18061ea9d790
Error: No such container: 18061ea9d790
Error response from daemon: Cannot kill container: a1be09e34b60: No such container: a1be09e34b60
Error: No such container: a1be09e34b60
Error response from daemon: Cannot kill container: 994019097cad: No such container: 994019097cad
Error: No such container: 994019097cad
Error response from daemon: Cannot kill container: 5fcbefcf8899: No such container: 5fcbefcf8899
Error: No such container: 5fcbefcf8899
Error response from daemon: Cannot kill container: c5485aa49de0: No such container: c5485aa49de0
Error: No such container: c5485aa49de0
Error response from daemon: Cannot kill container: 7bc1b8494882: Container 7bc1b84948828deb4822215cf727aeb673deaaa34e37399145bf9f2f7ca2b439 is not running
Unable to find image 'ubuntu:14.10' locally
14.10: Pulling from library/ubuntu
b0efe5c05b4c: Pulling fs layer
0a1f1b169319: Pulling fs layer
1ceb0a3c7c48: Pulling fs layer
a3ed95caeb02: Pulling fs layer
a3ed95caeb02: Waiting
1ceb0a3c7c48: Verifying Checksum
1ceb0a3c7c48: Download complete
0a1f1b169319: Verifying Checksum
0a1f1b169319: Download complete
a3ed95caeb02: Verifying Checksum
a3ed95caeb02: Download complete
b0efe5c05b4c: Verifying Checksum
b0efe5c05b4c: Download complete
b0efe5c05b4c: Pull complete
0a1f1b169319: Pull complete
1ceb0a3c7c48: Pull complete
a3ed95caeb02: Pull complete
Digest: sha256:6341c688b4b0b82ec735389b3c97df8cf2831b8cb8bd1856779130a86574ac5c
Status: Downloaded newer image for ubuntu:14.10